�����̖�,�{�ݔԍ�,�{�ݖ���,����E�n��,�ݒu����,�ݒu�ړI,�{�ݗp�r�i��ʁj,���E����,���ΐE����,���̑��E����,�^�c�`��,�w��Ǘ�����(�J�n),�w��Ǘ�����(�I��),�Ǘ��^�c������i�S�́j,�Ǘ��^�c��i�萔���E�g�p�������j,�Ǘ��^�c��i�����x�o���j,�Ǘ��^�c��i���̑������j,�Ǘ��^�c��x�o�i�S�́j,�Ǘ��^�c��i�l����j,�Ǘ��^�c��i������j,�Ǘ��^�c��i�w��Ǘ����j,�Ǘ��^�c��i�������p��j,�Ǘ��^�c��i���̑��x�o�j,�⏕���L��,�H��������E�C�U��,�d�C�i�g�p�ʁj,�d�C�i�����j,�d�C�i���d�ʁj,�㐅�i�g�p�ʁj,�㐅�i�����j,�����i�g�p�ʁj,�����i�����j,�H�Ɨp���i�g�p�ʁj,�H�Ɨp���i�����j,�s�s�K�X�i�g�p�ʁj,�s�s�K�X�i�����j,�v���p���K�X�i�g�p�ʁj,�v���p���K�X�i�����j,�d���i�g�p�ʁj,�d���i�����j,�����i�g�p�ʁj,�����i�����j,�y���i�g�p�ʁj,�y���i�����j,��ȗ��p��,���p�l���i�Z�����p�{�݁j,�J�ٓ����i�Z�����p�{��),���p�\�R�}���i�݊فj,���p�R�}���i�݊فj,���p�Ғ��ԉ\�䐔,�N�Ԓ��ԏꗘ�p�䐔,�ݏo�\�������i�}���فj,�N�ԑݏo�����i�}���فj,�S�ː��i���Z�{�݁j,�����ː��i���Z�{�݁j,������i�����{�݁j,���p�������i�����{�݁j,�w�����i�w�Z�{�݁j,���k���i�w�Z�{�݁j,�W��,�Ôg�Z���\�����i�k�P�j,�Ôg�Z���\�����i�k�Q�j,���{�ݎw��̗L��
���Îs,1,���Îs����ꏬ�w�Z,03,�����{�@�A�w�Z����@�A���Îs���w�Z�ݒu���,,D-4,,,,01,,,,,,,,,,,,,,,,,,,,,,,,,,,,,,,,,,,,,,,,,,,,,,,,,,,,
���Îs,2,���Îs����񏬊w�Z,03,�����{�@�A�w�Z����@�A���Îs���w�Z�ݒu���,,D-4,,,,01,,,,,,,,,,,,,,,,,,,,,,,,,,,,,,,,,,,,,,,,,,,,,,,,,,,,
���Îs,3,���Îs����O���w�Z,03,�����{�@�A�w�Z����@�A���Îs���w�Z�ݒu���,,D-4,,,,01,,,,,,,,,,,,,,,,,,,,,,,,,,,,,,,,,,,,,,,,,,,,,,,,,,,,
���Îs,4,���Îs����l���w�Z,03,�����{�@�A�w�Z����@�A���Îs���w�Z�ݒu���,,D-4,,,,01,,,,,,,,,,,,,,,,,,,,,,,,,,,,,,,,,,,,,,,,,,,,,,,,,,,,
���Îs,5,���Îs����܏��w�Z,03,�����{�@�A�w�Z����@�A���Îs���w�Z�ݒu���,,D-4,,,,01,,,,,,,,,,,,,,,,,,,,,,,,,,,,,,,,,,,,,,,,,,,,,,,,,,,,
���Îs,6,���Îs���J�k���w�Z,03,�����{�@�A�w�Z����@�A���Îs���w�Z�ݒu���,,D-4,,,,01,,,,,,,,,,,,,,,,,,,,,,,,,,,,,,,,,,,,,,,,,,,,,,,,,,,,
���Îs,7,���Îs����{���w�Z,03,�����{�@�A�w�Z����@�A���Îs���w�Z�ݒu���,,D-4,,,,01,,,,,,,,,,,,,,,,,,,,,,,,,,,,,,,,,,,,,,,,,,,,,,,,,,,,
���Îs,8,���Îs���Еl���w�Z,03,�����{�@�A�w�Z����@�A���Îs���w�Z�ݒu���,,D-4,,,,01,,,,,,,,,,,,,,,,,,,,,,,,,,,,,,,,,,,,,,,,,,,,,,,,,,,,
���Îs,9,���Îs���������w�Z,03,�����{�@�A�w�Z����@�A���Îs���w�Z�ݒu���,,D-4,,,,01,,,,,,,,,,,,,,,,,,,,,,,,,,,,,,,,,,,,,,,,,,,,,,,,,,,,
���Îs,10,���Îs���剪���w�Z,03,�����{�@�A�w�Z����@�A���Îs���w�Z�ݒu���,,D-4,,,,01,,,,,,,,,,,,,,,,,,,,,,,,,,,,,,,,,,,,,,,,,,,,,,,,,,,,
���Îs,11,���Îs���ÉY������ъw�Z,05,�����{�@�A�w�Z����@�A���Îs���w�Z�ݒu���,,D-7,,,,01,,,,,,,,,,,,,,,,,,,,,,,,,,,,,,,,,,,,,,,,,,,,,,,,,,,,
���Îs,12,���Îs�����鏬�w�Z,03,�����{�@�A�w�Z����@�A���Îs���w�Z�ݒu���,,D-4,,,,01,,,,,,,,,,,,,,,,,,,,,,,,,,,,,,,,,,,,,,,,,,,,,,,,,,,,
���Îs,13,���Îs���啽���w�Z,03,�����{�@�A�w�Z����@�A���Îs���w�Z�ݒu���,,D-4,,,,01,,,,,,,,,,,,,,,,,,,,,,,,,,,,,,,,,,,,,,,,,,,,,,,,,,,,
���Îs,14,���Îs�����Y���w�Z,03,�����{�@�A�w�Z����@�A���Îs���w�Z�ݒu���,,D-4,,,,01,,,,,,,,,,,,,,,,,,,,,,,,,,,,,,,,,,,,,,,,,,,,,,,,,,,,
���Îs,15,���Îs�������w�Z,03,�����{�@�A�w�Z����@�A���Îs���w�Z�ݒu���,,D-4,,,,01,,,,,,,,,,,,,,,,,,,,,,,,,,,,,,,,,,,,,,,,,,,,,,,,,,,,
���Îs,16,���Îs���������w�Z,03,�����{�@�A�w�Z����@�A���Îs���w�Z�ݒu���,,D-4,,,,01,,,,,,,,,,,,,,,,,,,,,,,,,,,,,,,,,,,,,,,,,,,,,,,,,,,,
���Îs,17,���Îs�����я��w�Z,03,�����{�@�A�w�Z����@�A���Îs���w�Z�ݒu���,,D-4,,,,01,,,,,,,,,,,,,,,,,,,,,,,,,,,,,,,,,,,,,,,,,,,,,,,,,,,,
���Îs,18,���Îs�����Y���w�Z,03,�����{�@�A�w�Z����@�A���Îs���w�Z�ݒu���,,D-4,,,,01,,,,,,,,,,,,,,,,,,,,,,,,,,,,,,,,,,,,,,,,,,,,,,,,,,,,
���Îs,19,���Îs����r���w�Z,03,�����{�@�A�w�Z����@�A���Îs���w�Z�ݒu���,,D-4,,,,01,,,,,,,,,,,,,,,,,,,,,,,,,,,,,,,,,,,,,,,,,,,,,,,,,,,,
���Îs,20,���Îs�����򏬊w�Z,03,�����{�@�A�w�Z����@�A���Îs���w�Z�ݒu���,,D-4,,,,01,,,,,,,,,,,,,,,,,,,,,,,,,,,,,,,,,,,,,,,,,,,,,,,,,,,,
���Îs,21,���Îs����c���w�Z,03,�����{�@�A�w�Z����@�A���Îs���w�Z�ݒu���,,D-4,,,,01,,,,,,,,,,,,,,,,,,,,,,,,,,,,,,,,,,,,,,,,,,,,,,,,,,,,
���Îs,22,���Îs���������w�Z,03,�����{�@�A�w�Z����@�A���Îs���w�Z�ݒu���,,D-4,,,,01,,,,,,,,,,,,,,,,,,,,,,,,,,,,,,,,,,,,,,,,,,,,,,,,,,,,
���Îs,23,���Îs���剪�쏬�w�Z,03,�����{�@�A�w�Z����@�A���Îs���w�Z�ݒu���,,D-4,,,,01,,,,,,,,,,,,,,,,,,,,,,,,,,,,,,,,,,,,,,,,,,,,,,,,,,,,
���Îs,24,���Îs���˓c���w�Z,03,�����{�@�A�w�Z����@�A���Îs���w�Z�ݒu���,,D-4,,,,01,,,,,,,,,,,,,,,,,,,,,,,,,,,,,,,,,,,,,,,,,,,,,,,,,,,,
���Îs,25,���Îs����ꒆ�w�Z,02,�����{�@�A�w�Z����@�A���Îs���w�Z�ݒu���,,D-3,,,,01,,,,,,,,,,,,,,,,,,,,,,,,,,,,,,,,,,,,,,,,,,,,,,,,,,,,
���Îs,26,���Îs����񒆊w�Z,02,�����{�@�A�w�Z����@�A���Îs���w�Z�ݒu���,,D-3,,,,01,,,,,,,,,,,,,,,,,,,,,,,,,,,,,,,,,,,,,,,,,,,,,,,,,,,,
���Îs,27,���Îs����O���w�Z,02,�����{�@�A�w�Z����@�A���Îs���w�Z�ݒu���,,D-3,,,,01,,,,,,,,,,,,,,,,,,,,,,,,,,,,,,,,,,,,,,,,,,,,,,,,,,,,
���Îs,28,���Îs����l���w�Z,02,�����{�@�A�w�Z����@�A���Îs���w�Z�ݒu���,,D-3,,,,01,,,,,,,,,,,,,,,,,,,,,,,,,,,,,,,,,,,,,,,,,,,,,,,,,,,,
���Îs,29,���Îs����ܒ��w�Z,02,�����{�@�A�w�Z����@�A���Îs���w�Z�ݒu���,,D-3,,,,01,,,,,,,,,,,,,,,,,,,,,,,,,,,,,,,,,,,,,,,,,,,,,,,,,,,,
���Îs,30,���Îs���Еl���w�Z,02,�����{�@�A�w�Z����@�A���Îs���w�Z�ݒu���,,D-3,,,,01,,,,,,,,,,,,,,,,,,,,,,,,,,,,,,,,,,,,,,,,,,,,,,,,,,,,
���Îs,31,���Îs���������w�Z,02,�����{�@�A�w�Z����@�A���Îs���w�Z�ݒu���,,D-3,,,,01,,,,,,,,,,,,,,,,,,,,,,,,,,,,,,,,,,,,,,,,,,,,,,,,,,,,
���Îs,32,���Îs���剪���w�Z,02,�����{�@�A�w�Z����@�A���Îs���w�Z�ݒu���,,D-3,,,,01,,,,,,,,,,,,,,,,,,,,,,,,,,,,,,,,,,,,,,,,,,,,,,,,,,,,
���Îs,33,���Îs�����钆�w�Z,02,�����{�@�A�w�Z����@�A���Îs���w�Z�ݒu���,,D-3,,,,01,,,,,,,,,,,,,,,,,,,,,,,,,,,,,,,,,,,,,,,,,,,,,,,,,,,,
���Îs,34,���Îs���啽���w�Z,02,�����{�@�A�w�Z����@�A���Îs���w�Z�ݒu���,,D-3,,,,01,,,,,,,,,,,,,,,,,,,,,,,,,,,,,,,,,,,,,,,,,,,,,,,,,,,,
���Îs,35,���Îs������蒆�w�Z,02,�����{�@�A�w�Z����@�A���Îs���w�Z�ݒu���,,D-3,,,,01,,,,,,,,,,,,,,,,,,,,,,,,,,,,,,,,,,,,,,,,,,,,,,,,,,,,
���Îs,36,���Îs�������w�Z,02,�����{�@�A�w�Z����@�A���Îs���w�Z�ݒu���,,D-3,,,,01,,,,,,,,,,,,,,,,,,,,,,,,,,,,,,,,,,,,,,,,,,,,,,,,,,,,
���Îs,37,���Îs���������w�Z,02,�����{�@�A�w�Z����@�A���Îs���w�Z�ݒu���,,D-3,,,,01,,,,,,,,,,,,,,,,,,,,,,,,,,,,,,,,,,,,,,,,,,,,,,,,,,,,
���Îs,38,���Îs�����򒆊w�Z,02,�����{�@�A�w�Z����@�A���Îs���w�Z�ݒu���,,D-3,,,,01,,,,,,,,,,,,,,,,,,,,,,,,,,,,,,,,,,,,,,,,,,,,,,,,,,,,
���Îs,39,���Îs����r���w�Z,02,�����{�@�A�w�Z����@�A���Îs���w�Z�ݒu���,,D-3,,,,01,,,,,,,,,,,,,,,,,,,,,,,,,,,,,,,,,,,,,,,,,,,,,,,,,,,,
���Îs,40,���Îs�����Í����w�Z�E���Îs�����Í����w�Z������,05,���Îs���w�Z�ݒu���,�w�Z�{��,D-7,,,,01,,,,,,,,,,,,,,,,,,,,,,,,,,,,,,,,,,,,,,,,,,,,,,,,,,,,
���Îs,41,���Îs���˓c���w�Z,02,�����{�@�A�w�Z����@�A���Îs���w�Z�ݒu���,,D-3,,,,01,,,,,,,,,,,,,,,,,,,,,,,,,,,,,,,,,,,,,,,,,,,,,,,,,,,,
���Îs,42,���Îs���啽�c�t��,01,�����{�@�A�w�Z����@�A���Îs���w�Z�ݒu���,,D-5,,,,01,,,,,,,,,,,,,,,,,,,,,,,,,,,,,,,,,,,,,,,,,,,,,,,,,,,,
���Îs,43,���Îs���˓c�c�t��,01,�����{�@�A�w�Z����@�A���Îs���w�Z�ݒu���,,D-5,,,,01,,,,,,,,,,,,,,,,,,,,,,,,,,,,,,,,,,,,,,,,,,,,,,,,,,,,
���Îs,44,�˓c���E���Z��,05,,,K-2,,,,01,,,,,,,,,,,,,,,,,,,,,,,,,,,,,,,,,,,,,,,,,,,,,,,,,,,,
���Îs,45,���E�����C�Z���^�[,05,���Îs���N����Z���^�[���,�u�����̎Љ��S���w������l�x�Â���v�̎����Ɍ����āA���Îs�̎q�ǂ��Ɏ��̍��������񋟂��Ă����K�v������B���̂��߂ɁA���E���̐��E�Ƃ��Ă̌��C���[�������A���������}�邱�Ƃ�ړI�Ƃ��Đݒu�����B,A-5,,,,01,,,,,,,,,,,,,,,,,,,,,,,,,,,,,,,,,,,,,,,,,,,,,,,,,,,,
���Îs,46,���Îs���}����,01,���Îs�}���ُ���Q��,���l������s���̒m�I�v���ɉ����A���U�w�K�̋��_�ƂȂ�{�݂Ƃ��Đݒu���ꂽ�B,H-1,,,,01,,,,,,,,,,,,,,,,,,,,,,,,,,,,,,,,,,,,,,,,,,,,,,,,,,,,
���Îs,47,���Îs���˓c�}����,01,���Îs�}���ُ���Q��,���l������s���̒m�I�v���ɉ����A���U�w�K�̋��_�ƂȂ�{�݂Ƃ��Đݒu���ꂽ�B,H-1,,,,01,,,,,,,,,,,,,,,,,,,,,,,,,,,,,,,,,,,,,,,,,,,,,,,,,,,,
���Îs,48,���Îs���N����Z���^�[,01,���Îs���N����Z���^�[���@,���N�̌��S�Ȉ琬��}�邱�Ƃ�ړI�Ƃ��Đ��N����Z���^�[��ݒu����B,E-6,,,,01,,,,,,,,,,,,,,,,,,,,,,,,,,,,,,,,,,,,,,,,,,,,,,,,,,,,
���Îs,49,���Îs���ΘJ���N�z�[��,01,���Îs���ΘJ���N�z�[�����,������Ƃɓ������N�̕����ƌ��S�Ȉ琬��}��A���Ē�����Ƃ̐U���Ɋ�^���邽�߁A�ΘJ���N�z�[����ݒu����B,N-6,,,,02,,,,,,,,,,,,,,,,,,,,,,,,,,,,,,,,,,,,,,,,,,,,,,,,,,,,
���Îs,50,���Îs�����N���R�̉�,01,���Îs�����N���R�̉Ə��,�W�c�h���������O������ʂ����A�S�g���Ɍ��N�Ȑ��N�̌��S�琬�B,J-1,,,,01,,,,,,,,,,,,,,,,,,,,,,,,,,,,,,,,,,,,,,,,,,,,,,,,,,,,
���Îs,51,���Îs��߂Ƃт�M�R,01,���Îs��߂Ƃт�M�R���A���Îs��߂Ƃт�M�R���{�s�K��,���N�y�ѐ��N�w���ғ����A�Љ�I���{�����߂邽�߂̏W�c���C�y�юЉ�犈�������{������񋟂��邽��,J-1,,,,01,,,,,,,,,,,,,,,,,,,,,,,,,,,,,,,,,,,,,,,,,,,,,,,,,,,,
���Îs,52,���Îs���j����������,01,,�Љ��{�݂Ƃ������̓W����ی�ۑ��A�[�֕��y�����Ȃǂ�ʂ��Ďs���̐��U����������邱�ƁA�܂��A�������������Ȃǂ�ʂ��āA���̎������s���ɒ񋟂��A�n��Љ�̂��悢���W�ƕ����̐U���Ɋ�^���邱�Ƃ�ړI�Ƃ��Ă���B,H-5,,,,01,,,,,,,,,,,,,,,,,,,,,,,,,,,,,,,,,,,,,,,,,,,,,,,,,,,,
���Îs,52.1,���Îs���j����������  ���ÉY�����w�Z������,05,,�����������̎���,H-5,,,,01,,,,,,,,,,,,,,,,,,,,,,,,,,,,,,,,,,,,,,,,,,,,,,,,,,,,
���Îs,52.2,���Îs���j���������� ��������,05,,�����������̎����W��,H-5,,,,01,,,,,,,,,,,,,,,,,,,,,,,,,,,,,,,,,,,,,,,,,,,,,,,,,,,,
���Îs,53,���Îs�����j����,01,�����ٖ@�A���Îs�����ُ��,���y�̈̐l�]���f�Z��A�É�����˂̔ˍZ���Õ��w�Z�𒆐S�ɁA���y�̋ߑ㉻�̂���݂��Љ�锎���قł���A�s�������̌��㔭�W�Ɋ�^���邱�Ƃ�ړI�Ƃ���B,H-2,,,,01,,,,,,,,,,,,,,,,,,,,,,,,,,,,,,,,,,,,,,,,,,,,,,,,,,,,
���Îs,54,���Îs�˓c���D���y����������,01,�����ٖ@�E���Îs�����ُ��y�ѓ��{�s�K��,���V�A�R�̓f�B�A�i���̑�D�Ƃ��āA�˓c�Ō������ꂽ�m�����D�w�_���̑��D�Ɋւ�鎑���ƃv�`���[�`���̈�i���𒆐S�ɁA�����W�����邽�߂̎{�݂Ƃ��Đݗ����ꂽ�B,H-2,,,,01,,,,,,,,,,,,,,,,,,,,,,,,,,,,,,,,,,,,,,,,,,,,,,,,,,,,
���Îs,55,���Îs��R�q���L�O��,01,���Îs��R�q���L�O�ُ��,��R�q���̌����Ɩ{�s�䂩��̕��w�ҋy�т��̔w�i�ƂȂ���Â̕��w���y���L���Љ�邱�Ƃɂ���āA�s���̕���������U�����A�n��������ޕ����s�s�Â����ڎw�����߂ɐݒu���ꂽ�B,H-5,,,,03,2006/4/1,2016/3/31,,,,,,,,,,,,,,,,,,,,,,,,,,,,,,,,,,,,,,,,,,,,,,,,,,
���Îs,56,���Îs���i���p��,01,���Îs���i���p�ُ��,���p�̐U����}��A�s���̕����̔��W�Ɋ�^����,H-4,,,,03,2011/4/1,2016/3/31,,,,,,,,,,,,,,,,,,,,,,,,,,,,,,,,,,,,,,,,,,,,,,,,,,
���Îs,57,�������Z���^�[,01,�������ی�@,�������ی쎖���y�юs�j�Ҏ[�������{�s����ړI,H-5,,,,01,,,,,,,,,,,,,,,,,,,,,,,,,,,,,,,,,,,,,,,,,,,,,,,,,,,,
���Îs,58,���Îs�ڑ�����ǋL�O��,01,���Îs�ڑ�����ǋL�O�ُ��,���Îs������Ő��܂��������l�ł���A���Îs���_�s���ł�����ڑ�����ǂ̋ƐтƐl�������m���邱�Ƃ�ړI�Ƃ��Ă���B,H-5,,,,01,,,,,,,,,,,,,,,,,,,,,,,,,,,,,,,,,,,,,,,,,,,,,,,,,,,,
���Îs,59,���Îs���̈��,01,���Îs���̈�ُ��,�s�����X�|�[�c��ڕW�ɁA���N�ŖL���Ȑ����̌����ړI�ɁA�s�����C�y�ɗ��p�ł���X�|�[�c�E���N���G�[�V���������̋��_�Ƃ��Đݒu�B,I-1,,,,,,,,,,,,,,,,,,,,,,,,,,,,,,,,,,,,,,,,,,,,,,,,,,,,,,,,
���Îs,60,���ËΘJ�ґ̈�Z���^�[,01,���ËΘJ�ґ̈�Z���^�[���,������ƂɌٗp�����ΘJ�҂̕����̑��i��}��ƂƂ��ɁA���̌ٗp�̈���Ɏ�����,I-1,,,,02,,,,,,,,,,,,,,,,,,,,,,,,,,,,,,,,,,,,,,,,,,,,,,,,,,,,
���Îs,61,���Îs�c�싅��,01,���Îs�c�싅����,��싅�̋���Ƃ��Đݒu���A���E���w�E��ʁE��ƒc�̂Ƒ����ʂɂ킽���Ďg�p����Ă���,I-2,,,,02,,,,,,,,,,,,,,,,,,,,,,,,,,,,,,,,,,,,,,,,,,,,,,,,,,,,
���Îs,62,���������v�[��,01,���Îs���������v�[�����,�אڂ��鐴�|�v�����g�̃S�~�ċp�M�𗘗p���������v�[���Ƃ��āA��N��ʂ��Ďs���̌��N���i�E�����̌����}��B,I-3-2,,,,02,,,,,,,,,,,,,,,,,,,,,,,,,,,,,,,,,,,,,,,,,,,,,,,,,,,,
���Îs,63,���Îs���˕�����,01,���Îs���˕�������,������ʂ��X�|�[�c�̐U���Ǝs���̐S�g�̌��S�Ȉ琬����}�邽��,I-1,,,,02,,,,,,,,,,,,,,,,,,,,,,,,,,,,,,,,,,,,,,,,,,,,,,,,,,,,
���Îs,64,���Îs�˓cB&G�C�m�Z���^�[,01,���Îs�˓cB&G�C�m�Z���^�[���,B&G���c�ɂ��A���N�̌��S�琬�ƌ��N�Â���̂��߂̎{�݂Ƃ��āA�̈�قƃv�[��������������X�|�[�c�{�݂Ƃ��Đݒu���ꂽ�B,I-1,,,,01,,,,,,,,,,,,,,,,,,,,,,,,,,,,,,,,,,,,,,,,,,,,,,,,,,,,
���Îs,65,���Îs�������Z���^�[,01,���Îs�������Z���^�[���,�s���̌|�p�����̐U���ƕ����̑��i��}�邽��,H-4,,,,03,2012/4/1,2015/3/31,,,,,,,,,,,,,,,,,,,,,,,,,,,,,,,,,,,,,,,,,,,,,,,,,,
���Îs,66,���Îs�剪�n��Z���^�[,01,�n�������@��244���y�я��Îs�n��Z���^�[���Ɋ�Â�,�n��Z���^�[�̐ݒu�́A�n��Z���̎�̐��A���含�Ɋ�Â����܂��Â���𐄐i���邱�Ƃ�ړI�Ƃ��Ă���A������������߁A�h�ЁA���U����A�n�敟���ȂǁA�l�X�ȃR�~���j�e�B�����̋��_�{�݂Ƃ��Ċ��p����Ă���B,C-1,,,,03,2011/4/1,2016/3/31,,,,,,,,,,,,,,,,,,,,,,,,,,,,,,,,,,,,,,,,,,,,,,,,,,
���Îs,67,���Îs�啽�n��Z���^�[,01,�n�������@��Q�S�S���y�я��Îs�n��Z���^�[���Ɋ�Â�,�n��Z���^�[�̐ݒu�́A�n��Z���̎�̐��A���含�Ɋ�Â����܂��Â���𐄐i���邱�Ƃ�ړI�Ƃ��Ă���A������������߁A�h�ЁA���U����A�n�敟���ȂǁA�l�X�ȃR�~���j�e���C�����̋��_�{�݂Ƃ��Ċ��p����Ă���B,C-1,,,,03,2011/4/1,2016/3/31,,,,,,,,,,,,,,,,,,,,,,,,,,,,,,,,,,,,,,,,,,,,,,,,,,
���Îs,68,���Îs���Y�n��Z���^�[,01,���Îs�n��Z���^�[���A���{�s�K��,�s�����s�������̂܂��Â����i�߂邽�߂̊����{�݂Ƃ���,C-1,,,,03,2011/4/1,2016/3/31,,,,,,,,,,,,,,,,,,,,,,,,,,,,,,,,,,,,,,,,,,,,,,,,,,
���Îs,69,���Îs�����n��Z���^�[,01,�n�������@��244���y�я��Îs�n��Z���^�[�ݒu���Ɋ�Â�,�n��Z���^�[�̐ݒu�́A�n��Z���̎�̐��A���含�Ɋ�Â����܂��Â���𑣐i���邱�Ƃ�ړI�Ƃ��Ă���A������������߁A�h�ЁA���U����A�n�敟���ȂǁA�l�X�ȃR�~���j�e�B�����̋��_�{�݂Ƃ��Ċ��p����Ă���B,C-1,,,,03,2011/4/1,2016/3/31,,,,,,,,,,,,,,,,,,,,,,,,,,,,,,,,,,,,,,,,,,,,,,,,,,
���Îs,70,���Îs���n��Z���^�[,01,���Îs�n��Z���^�[���A���{�s�K��,�s�����s�������̂܂��Â����i�߂邽�߂̊����{�݂Ƃ���,C-1,,,,03,2011/4/1,2016/3/31,,,,,,,,,,,,,,,,,,,,,,,,,,,,,,,,,,,,,,,,,,,,,,,,,,
���Îs,71,���Îs���n��Z���^�[,01,�n�������@��244���y�я��Îs�n��Z���^�[���Ɋ�Â�,�n��Z���^�[�̐ݒu�́A�n��Z���̎�̐��A���含�Ɋ�Â����܂��Â���𑣐i���邱�Ƃ�ړI�Ƃ��Ă���A������������߁A�h�ЁA���U����A�n�敟���ȂǗl�X�ȃR�~���j�e�B�����̋��_�{�݂Ƃ��Ċ��p����Ă���B,C-1,,,,03,2011/4/1,2016/3/31,,,,,,,,,,,,,,,,,,,,,,,,,,,,,,,,,,,,,,,,,,,,,,,,,,
���Îs,72,���Îs��l�n��Z���^�[,01,���Îs�n��Z���^�[���A���{�s�K��,�s�����s�������̂܂��Â����i�߂邽�߂̊����{�݂Ƃ���,C-1,,,,03,2011/4/1,2016/3/31,,,,,,,,,,,,,,,,,,,,,,,,,,,,,,,,,,,,,,,,,,,,,,,,,,
���Îs,73,���Îs�ÉY�n��Z���^�[,01,���Îs�n��Z���^�[���A���{�s�K��,�s�����s�������̂܂��Â����i�߂邽�߂̊����{�݂Ƃ���,C-1,,,,03,2011/4/1,2016/3/31,,,,,,,,,,,,,,,,,,,,,,,,,,,,,,,,,,,,,,,,,,,,,,,,,,
���Îs,74,���Îs�����n��Z���^�[,01,�n�������@��244���y�я��Îs�n��Z���^�[���Ɋ�Â�,�n��Z���^�[�̐ݒu�́A�n��Z���̎�̐��A���含�Ɋ�Â����܂��Â���𑣐i���邱�Ƃ�ړI�Ƃ��Ă���A������������߁A�h�ЁA���U����A�n�敟���ȂǁA�l�X�ȃR�~���j�e�B�����̋��_�{�݂Ƃ��Ċ��p����Ă���B,C-1,,,,03,2011/4/1,2016/3/31,,,,,,,,,,,,,,,,,,,,,,,,,,,,,,,,,,,,,,,,,,,,,,,,,,
���Îs,75,���Îs��ܒn��Z���^�[,01,���Îs�n��Z���^�[���A���{�s�K��,�s�����s�������̂܂��Â����i�߂邽�߂̊����{�݂Ƃ��Đݒu,C-1,,,,03,2011/4/1,2016/3/31,,,,,,,,,,,,,,,,,,,,,,,,,,,,,,,,,,,,,,,,,,,,,,,,,,
���Îs,76,���Îs�Еl�n��Z���^�[,01,���Îs�n��Z���^�[���A���{�s�K��,�s�����s�������̂܂��Â����i�߂邽�߂̊����{�݂Ƃ���,C-1,,,,03,2014/4/1,2019/3/31,,,,,,,,,,,,,,,,,,,,,,,,,,,,,,,,,,,,,,,,,,,,,,,,,,
���Îs,77,���Îs��O�n��Z���^�[,01,�n�������@��244���y�я��Îs�n��Z���^�[���Ɋ�Â�,�n��Z���^�[�̐ݒu�́A�n��Z���̎�̐��A���含�Ɋ�Â����܂��Â���𐄐i���邱�Ƃ�ړI�Ƃ��Ă���A������������߁A�h�ЁA���U����A�n�敟���ȂǁA�l�X�ȃR�~���j�e�B�����̋��_�{�݂Ƃ��Ċ��p����Ă���B,C-1,,,,03,2014/4/1,2019/3/31,,,,,,,,,,,,,,,,,,,,,,,,,,,,,,,,,,,,,,,,,,,,,,,,,,
���Îs,78,���Îs����n��Z���^�[,01,���Îs�n��Z���^�[���A���{�s�K��,�s�����s�������̂܂��Â����i�߂邽�߂̊����{�݂Ƃ���,C-1,,,,03,2012/4/1,2015/3/31,,,,,,,,,,,,,,,,,,,,,,,,,,,,,,,,,,,,,,,,,,,,,,,,,,
���Îs,79,���Îs��r�n��Z���^�[,01,���Îs�n��Z���^�[���A���{�s�K��,�s�����s�������̂܂��Â����i�߂邽�߂̊����{�݂Ƃ���,C-1,,,,03,2014/2/1,2017/3/31,,,,,,,,,,,,,,,,,,,,,,,,,,,,,,,,,,,,,,,,,,,,,,,,,,
���Îs,80,����W�,04,,����Z���̊������_�Ƃ��āB,C-4,,,,02,,,,,,,,,,,,,,,,,,,,,,,,,,,,,,,,,,,,,,,,,,,,,,,,,,,,
���Îs,81,�O�{���W�,04,,�O�{���Z���̊������_�Ƃ��āB,C-4,,,,02,,,,,,,,,,,,,,,,,,,,,,,,,,,,,,,,,,,,,,,,,,,,,,,,,,,,
���Îs,82,�����W�,04,,�����Z���̊������_�Ƃ��āB,C-4,,,,02,,,,,,,,,,,,,,,,,,,,,,,,,,,,,,,,,,,,,,,,,,,,,,,,,,,,
���Îs,83,���Îs���уR�~���j�e�B�h�ЃZ���^�[,05,���Îs�R�~���j�e�B�h�ЃZ���^�[���,�����ɂ����鎩��h�Њ����y�эЊQ���̉��}�����̋��_,C-4,,,,01,,,,,,,,,,,,,,,,,,,,,,,,,,,,,,,,,,,,,,,,,,,,,,,,,,,,
���Îs,84,���Îs������R�~���j�e�B�h�ЃZ���^�[,05,���Îs�R�~���j�e�B�h�ЃZ���^�[���,����h�Њ����𒆐S�Ƃ������펞�y�эЊQ���ɂ�����n��̖h�Ћ��_�Ƃ��邽�߁B,C-4,,,,03,2012/4/1,2015/3/31,,,,,,,,,,,,,,,,,,,,,,,,,,,,,,,,,,,,,,,,,,,,,,,,,,
���Îs,85,���Îs���h�Бq��,05,,��K�͍ЊQ�ɔ����A�h�Ў��@�ނ̔��~�y�ђn��̖h�Љ��}�����̋��_�Ƃ��邽��,N-1,,,,01,,,,,,,,,,,,,,,,,,,,,,,,,,,,,,,,,,,,,,,,,,,,,,,,,,,,
���Îs,86,����h�ЃZ���^�[,05,,�ЊQ�ɑ΂�������Ƃ��āA���h�p�ݔ��A���~�i�𐮔����铙�A�n��̉��}�Ή��̋��_,N-1,,,,01,,,,,,,,,,,,,,,,,,,,,,,,,,,,,,,,,,,,,,,,,,,,,,,,,,,,
���Îs,88,���剪������,05,,���a60�N�ɑ剪�������Ƃ��Đݒu���ꂽ���A����23�N�Ɋ�@�Ǘ��ۂɈڊǂ��ꂽ�B,N-6,,,,01,,,,,,,,,,,,,,,,,,,,,,,,,,,,,,,,,,,,,,,,,,,,,,,,,,,,
���Îs,89,���Îs�ی��Z���^�[,01,���Îs�ی��Z���^�[���A���Îs�ی��Z���^�[���{�s�K��,�s���̌��N�̕ێ��y�ё��i��}�邱��,G-1,,,,01,,,,,,,,,,,,,,,,,,,,,,,,,,,,,,,,,,,,,,,,,,,,,,,,,,,,
���Îs,90,���Îs�ی��Z���^�[�˓c����,01,���Îs�ی��Z���^�[���,�@�Z���̌��N�����A����Ɍ��N�̑��i��}�邽�߂̒n��ی������������߂邽�߂ɐݒu�����B,G-1,,,,01,,,,,,,,,,,,,,,,,,,,,,,,,,,,,,,,,,,,,,,,,,,,,,,,,,,,
���Îs,91,�k���ۈ珊,01,���������@,�����ۈ�{��,E-1,,,,01,,,,,,,,,,,,,,,,,,,,,,,,,,,,,,,,,,,,,,,,,,,,,,,,,,,,
���Îs,92,�i���j���Y�ۈ珊,05,���������@,�����ۈ�{��,N-6,,,,01,,,,,,,,,,,,,,,,,,,,,,,,,,,,,,,,,,,,,,,,,,,,,,,,,,,,
���Îs,92.1,���Y�ۈ珊,01,���������@,�����ۈ�{��,E-1,,,,01,,,,,,,,,,,,,,,,,,,,,,,,,,,,,,,,,,,,,,,,,,,,,,,,,,,,
���Îs,93,�啽�ۈ珊,01,���������@,�����ۈ�{��,E-1,,,,01,,,,,,,,,,,,,,,,,,,,,,,,,,,,,,,,,,,,,,,,,,,,,,,,,,,,
���Îs,94,�����ۈ珊,01,���������@,�����ۈ�{��,E-1,,,,01,,,,,,,,,,,,,,,,,,,,,,,,,,,,,,,,,,,,,,,,,,,,,,,,,,,,
���Îs,95,�剪�ۈ珊,01,���������@,�����ۈ�{��,E-1,,,,01,,,,,,,,,,,,,,,,,,,,,,,,,,,,,,,,,,,,,,,,,,,,,,,,,,,,
���Îs,96,�Ƃ���ۈ珊,01,���������@,�����ۈ�{��,E-1,,,,01,,,,,,,,,,,,,,,,,,,,,,,,,,,,,,,,,,,,,,,,,,,,,,,,,,,,
���Îs,97,�˓c�ۈ珊,01,���������@,�����ۈ�{��,E-1,,,,01,,,,,,,,,,,,,,,,,,,,,,,,,,,,,,,,,,,,,,,,,,,,,,,,,,,,
���Îs,98,���Îs���������w��,01,���������@��S�Q���@���Îs����Q�������{�ݏ��,"(��Q�������{�݁j
��ɒm�I��Q�̂��鎙������������āA�Љ�I�����̂��߂ɕK�v�ȉ������s�����Ƃ�ړI�Ƃ��Đݒu",E-7,,,,03,2013/4/1,2018/3/31,,,,,,,,,,,,,,,,,,,,,,,,,,,,,,,,,,,,,,,,,,,,,,,,,,
���Îs,99,�������B�x���Z���^�[�݂䂫,01,���������@��S�R���@���Îs�������B�x���Z���^�[���,"�i�������B�x���Z���^�[�j
���B�ɏ�Q���������̒ʏ��ɂ��È�w���⑊�k���̎x�����s�����Ƃ�ړI�Ƃ��Đݒu",E-7,,,,01,,,,,,,,,,,,,,,,,,,,,,,,,,,,,,,,,,,,,,,,,,,,,,,,,,,,
���Îs,100,���Â��q�ӂꂠ���Z���^�[,01,���������@,�����ۈ�{��,E-7,,,,01,,,,,,,,,,,,,,,,,,,,,,,,,,,,,,,,,,,,,,,,,,,,,,,,,,,,
���Îs,101,�ӂꂠ���v���U������,01,���������@,�����ۈ�{��,E-7,,,,01,,,,,,,,,,,,,,,,,,,,,,,,,,,,,,,,,,,,,,,,,,,,,,,,,,,,
���Îs,102,�ӂꂠ���v���U�ւ�����,01,���������@,�����ۈ�{��,E-7,,,,01,,,,,,,,,,,,,,,,,,,,,,,,,,,,,,,,,,,,,,,,,,,,,,,,,,,,
���Îs,103,����ڂ�q��Ďx���Z���^�[,01,���������@,�����ۈ�{��,E-7,,,,01,,,,,,,,,,,,,,,,,,,,,,,,,,,,,,,,,,,,,,,,,,,,,,,,,,,,
���Îs,104,���Îs����𗬃Z���^�[�E���Îs�V�l�����Z���^�[(��{�v���U��),01,�V�l�����@�A���Îs����ғ���������𗬊����{�ݏ��A���{�s�K��,����҂��͂��߂Ƃ���s���̌𗬊����𑣐i���A���{�A�����y�ѕ����̌����}��,G-2,,,,03,2013/4/1,2016/3/31,,,,,,,,,,,,,,,,,,,,,,,,,,,,,,,,,,,,,,,,,,,,,,,,,,
���Îs,106,���Îs��{�f�C�T�[�r�X�Z���^�[(��{�v���U���j,01,�V�l�����@�A���Îs�V�l�f�C�T�[�r�X�Z���^�[���A���{�s�K��,�ݑ�ł̉���K�v�Ƃ��鍂��ҋy�щ��҂̕����̑��i��}��,G-2,,,,03,2013/4/1,2016/3/31,,,,,,,,,,,,,,,,,,,,,,,,,,,,,,,,,,,,,,,,,,,,,,,,,,
���Îs,107,���Îs���V�l�����Z���^�[�i������ҕ����Z���^�[���j,01,�V�l�����@�A���Îs����ҕ����Z���^�[���A���{�s�K��,����҂ɑ΂��āA���N�̑��i�A���{�̌���y�у��N���G�[�V�����̂��߂̕֋X�𑍍��I�ɋ��^���邱��,G-2,,,,03,2011/4/1,2016/3/31,,,,,,,,,,,,,,,,,,,,,,,,,,,,,,,,,,,,,,,,,,,,,,,,,,
���Îs,108,���Îs���޲���޽�����i������ҕ����Z���^�[���j,01,���Îs�V�l�f�C�T�[�r�X�Z���^�[���E�{�s�K��,�ݑ�ł̉���K�v�Ƃ��鍂��ҋy�т��̉��҂̕����̑��i��}��,F-1-1,,,,03,2012/4/1,2015/3/31,,,,,,,,,,,,,,,,,,,,,,,,,,,,,,,,,,,,,,,,,,,,,,,,,,
���Îs,109,���Îs��܏��w�Z�f�C�T�[�r�X�Z���^�[,01,���Îs�V�l�f�C�T�[�r�X�Z���^�[���E�{�s�K��,�ݑ�ł̉���K�v�Ƃ��鍂��ҋy�т��̉��҂̕����̑��i��}�邽�߁B,F-1-1,,,,03,2012/4/1,2015/3/31,,,,,,,,,,,,,,,,,,,,,,,,,,,,,,,,,,,,,,,,,,,,,,,,,,
���Îs,110,���Îs�˓c�f�C�T�[�r�X�Z���^�[,01,�V�l�����@�A���Îs�V�l�f�C�T�[�r�X�Z���^�[���,�ݑ�ł̉���K�v�Ƃ��鍂��ҋy�т��̉��҂̕����̑��i��}�邽��,F-1-1,,,,03,2012/4/1,2015/3/31,,,,,,,,,,,,,,,,,,,,,,,,,,,,,,,,,,,,,,,,,,,,,,,,,,
���Îs,111,���Îs����Ґ������������x���Z���^�[�����i���������z�[���������j,01,���Îs����҉��\�h���_�{�ݏ��,����҂̐S�g�@�\�̈ێ�����y�ѐ��������Â��蓙�𑣐i����ƂƂ��ɁA���N�̑��i�y�ы��{�̌����}��,F-1-1,,,,03,2012/4/1,2015/3/31,,,,,,,,,,,,,,,,,,,,,,,,,,,,,,,,,,,,,,,,,,,,,,,,,,
���Îs,112,���Îs����҂ӂꂠ���v���U�����i���������z�[���������j,01,���Îs����҉��\�h���_�{�ݏ��,����҂̐S�g�@�\�̈ێ�����y�ѐ��������Â��蓙�𑣐i����ƂƂ��ɁA���N�̑��i�y�ы��{�̌����}��,F-3,,,,03,2012/4/1,2015/3/31,,,,,,,,,,,,,,,,,,,,,,,,,,,,,,,,,,,,,,,,,,,,,,,,,,
���Îs,113,���Îs�˓c�V�l�e�̉�,01,���Îs�˓c�V�l�e�̉Ə��{�s�K��,�V�l�ɑ΂��ċ��{�A���N���G�[�V�����y�ыx�{���̏��񋟂��A�����ĘV�l�̐S�g�̌��N���i��}��,F-2,,,,03,2014/4/1,2015/3/31,,,,,,,,,,,,,,,,,,,,,,,,,,,,,,,,,,,,,,,,,,,,,,,,,,
���Îs,114,���Îs����ҏA�ƃZ���^�[,01,���Îs����ҏA�ƃZ���^�[���,����ҁi�T�T�Έȏ�j�̏A�Ƃ𑣐i���A���������̑n����}��ƂƂ��ɁA�s���̕����̑��i�Ɋ�^���邱��,N-6,,,,03,2014/4/1,2017/3/31,,,,,,,,,,,,,,,,,,,,,,,,,,,,,,,,,,,,,,,,,,,,,,,,,,
���Îs,115,�͂�w��f�C�T�[�r�X�Z���^�[,01,���ی��@�@,�񕍎҂̈�u�Ɋ�Â��n��ɂ����鍂��ҕ����{�݂Ƃ��Ă̊��p��}��B�n������҂̌𗬂̏�Ƃ��Ċ��p��}��B,F-1-1,,,,02,,,,,,,,,,,,,,,,,,,,,,,,,,,,,,,,,,,,,,,,,,,,,,,,,,,,
���Îs,116,���Ö�ԋ~�}��ÃZ���^�[,01,���Ö�ԋ~�}��ÃZ���^�[���,��Ԃɂ����ċ~�}�̈�Â�K�v�Ƃ���҂ɑ΂��A���}�̈�Â��s�����߁B,M-1,,,,03,2011/4/1,2016/3/31,,,,,,,,,,,,,,,,,,,,,,,,,,,,,,,,,,,,,,,,,,,,,,,,,,
���Îs,117,���Îs���a�@,01,���Îs���a�@���E���Îs���a�@�����K��,�}���������߂Ƃ��鍂�x��Â̒�,M-1,,,,01,,,,,,,,,,,,,,,,,,,,,,,,,,,,,,,,,,,,,,,,,,,,,,,,,,,,
���Îs,118,�˓c�f�Ï�,01,���Îs�˓c�f�Ï����,�˓c�n��̏Z���̌��N�ێ��ɕK�v�Ȉ�Â�񋟂��邽�߁A�f�Ï���ݒu�����B,M-1,,,,03,2014/4/1,2019/3/31,,,,,,,,,,,,,,,,,,,,,,,,,,,,,,,,,,,,,,,,,,,,,,,,,,
���Îs,119,���Îs��������,01,�n�������@�A�����ی�@�A���Îs���~��{�ݐݒu���,�����ی�@�Ɋ�Â��~��{�݂ł���A�g�̏㖔�͐��_�㒘������Q������A�������ē��퐶�����c�ނ��Ƃ�����ȗv�ی�҂���������Љ�A�������͎������x������{��,G-2,,,,03,2012/4/1,2017/3/31,,,,,,,,,,,,,,,,,,,,,,,,,,,,,,,,,,,,,,,,,,,,,,,,,,
���Îs,120,���Îs��e��,01,���������@��R�W���A���Îs����q�����x���{�ݏ��,"�i��q�����x���{�݁j
�z��҂̂��Ȃ����q�܂��͂���ɏ����鎖��ɂ��鏗�q�y�т��̎�������������āA�ی삷��ƂƂ��ɁA�����֌����������̎x�����s�����Ƃ�ړI�Ƃ��Đݒu",E-7,,,,01,,,,,,,,,,,,,,,,,,,,,,,,,,,,,,,,,,,,,,,,,,,,,,,,,,,,
���Îs,121,�ʂ܂Ì��N�����v���U�i���Ö�ԋ~�}��ÃZ���^�[�����������B�j,01,���Îs���N�����v���U���E���Îs���N�����v���U���{�s�K��,�����A�ی��i�y�ш�Áj�̘A�g�ɂ��s���̒n�敟���ƌ��N�Â���̐��i��}��,G-2,,,,03,2014/4/1,2019/3/31,,,,,,,,,,,,,,,,,,,,,,,,,,,,,,,,,,,,,,,,,,,,,,,,,,
���Îs,122,���Îs���Ō���w�Z,01,,�Ō���w�Z�̉^�c,D-7,,,,,,,,,,,,,,,,,,,,,,,,,,,,,,,,,,,,,,,,,,,,,,,,,,,,,,,,
���Îs,123,���Îs���Y�C�l�{��,01,���Îs���Y�C�l�{�ݏ��,�C�݂̕ۑS�i�����΍�j�ƂƂ��ɁA���`�ƊC�l���p�̒��a��}�钆�ŁA���K�Ȑ��Ӌ�Ԃ�n�o���邽�ߗ{�l���̊C�݊�������ړI�ɐ����B,J-1,,,,03,2013/4/1,2016/3/31,,,,,,,,,,,,,,,,,,,,,,,,,,,,,,,,,,,,,,,,,,,,,,,,,,
���Îs,124,������̓n���D,01,���Îs�n���D���,�b�܂ꂽ���ӂ����p���A���킹�Ċό��U����}�邽�߁B,J-1,,,,03,2012/4/1,2015/3/31,,,,,,,,,,,,,,,,,,,,,,,,,,,,,,,,,,,,,,,,,,,,,,,,,,
���Îs,125,���Í`����W�]�{��,01,���Í`����W�]�{�ݏ��,�b�܂ꂽ���R�i�ς����p���A�C�ӂ̓��킢�Â����i�߂邽�߁A�W�]�{�݂�ݒu�����B,J-1,,,,03,2013/4/1,2016/3/31,,,,,,,,,,,,,,,,,,,,,,,,,,,,,,,,,,,,,,,,,,,,,,,,,,
���Îs,126,���Îs�˓c��̓�����,01,���Îs�˓c����{�ݏ��,�s���̌��N���i�y�ъό��U���Ɋ�^���邽�߁A����{�݂�ݒu�����B,J-1,,,,03,2013/4/1,2015/3/31,,,,,,,,,,,,,,,,,,,,,,,,,,,,,,,,,,,,,,,,,,,,,,,,,,
���Îs,127,���Îs�˓c�͂��ܑ�I�[�g�L�����v��,01,���Îs�˓c�I�[�g�L�����v����,���R�̒��Ō��S�ȃ��N���[�V�������������{������񋟂���ƂƂ��ɁA�ό��̐U����}�邽�߁A�I�[�g�L�����v���ݒu�����B,J-1,,,,03,2012/4/1,2015/3/31,,,,,,,,,,,,,,,,,,,,,,,,,,,,,,,,,,,,,,,,,,,,,,,,,,
���Îs,128,�s���̐X,01,,�u�l�Ǝ��R�Ƃ̒��a�v���e�[�}�ɋM�d�Ȏ��R���̕ۑS��}��A�L���Ȏ��R�ƐG�ꍇ���A�y���ޒ��Ŏ��R�̑�؂���̊��ł����O�����̏��񋟂��邱��,J-1,,,,01,,,,,,,,,,,,,,,,,,,,,,,,,,,,,,,,,,,,,,,,,,,,,,,,,,,,
���Îs,129,�L�����b�Z�ʂ܂�,01,���Îs���ړI�W���C�x���g�{�ݏ��,�n��̎Y�Ƌy�ѕ����̐U���Ɏ����邱�Ƃ�ړI�Ƃ��đ��ړI�W���C�x���g�{�݂�ݒu�����B,J-1,,,,03,2013/4/1,2019/3/31,,,,,,,,,,,,,,,,,,,,,,,,,,,,,,,,,,,,,,,,,,,,,,,,,,
���Îs,130,��l�������Ǘ�������,05,,�ċG���Ԃ̊C�l�x���������y�ъC������Ď����̏h�ɂƂ��ė��p���邱�Ƃ�ړI�ɁA���̑��̊��Ԃ́A��l�������y�ь˓c�n��ό��{�݂̐��|�A���@�ޑq�ɂƂ��ė��p���邱�Ƃ�ړI�ɐݒu�����B,N-6,,,,01,,,,,,,,,,,,,,,,,,,,,,,,,,,,,,,,,,,,,,,,,,,,,,,,,,,,
���Îs,131,�����Îs���ÉY�����w�Z,05,�����{�@�A�w�Z����@�A���Îs���w�Z�ݒu���,0,N-6,,,,01,,,,,,,,,,,,,,,,,,,,,,,,,,,,,,,,,,,,,,,,,,,,,,,,,,,,
���Îs,132,���ÉY���w�Z�i���̑O�͐ÉY�����w�Z�j,05,�����{�@�A�w�Z����@�A���Îs���w�Z�ݒu���,0,N-6,,,,01,,,,,,,,,,,,,,,,,,,,,,,,,,,,,,,,,,,,,,,,,,,,,,,,,,,,