�����̖�,�{�ݔԍ�,�{�ݖ���,����E�n��,�ݒu����,�ݒu�ړI,�{�ݗp�r�i��ʁj,���E����,���ΐE����,���̑��E����,�^�c�`��,�w��Ǘ�����(�J�n),�w��Ǘ�����(�I��),�Ǘ��^�c������i�S�́j,�Ǘ��^�c��i�萔���E�g�p�������j,�Ǘ��^�c��i�����x�o���j,�Ǘ��^�c��i���̑������j,�Ǘ��^�c��x�o�i�S�́j,�Ǘ��^�c��i�l����j,�Ǘ��^�c��i������j,�Ǘ��^�c��i�w��Ǘ����j,�Ǘ��^�c��i�������p��j,�Ǘ��^�c��i���̑��x�o�j,�⏕���L��,�H��������E�C�U��,�d�C�i�g�p�ʁj,�d�C�i�����j,�d�C�i���d�ʁj,�㐅�i�g�p�ʁj,�㐅�i�����j,�����i�g�p�ʁj,�����i�����j,�H�Ɨp���i�g�p�ʁj,�H�Ɨp���i�����j,�s�s�K�X�i�g�p�ʁj,�s�s�K�X�i�����j,�v���p���K�X�i�g�p�ʁj,�v���p���K�X�i�����j,�d���i�g�p�ʁj,�d���i�����j,�����i�g�p�ʁj,�����i�����j,�y���i�g�p�ʁj,�y���i�����j,��ȗ��p��,���p�l���i�Z�����p�{�݁j,�J�ٓ����i�Z�����p�{��),���p�\�R�}���i�݊فj,���p�R�}���i�݊فj,���p�Ғ��ԉ\�䐔,�N�Ԓ��ԏꗘ�p�䐔,�ݏo�\�������i�}���فj,�N�ԑݏo�����i�}���فj,�S�ː��i���Z�{�݁j,�����ː��i���Z�{�݁j,������i�����{�݁j,���p�������i�����{�݁j,�w�����i�w�Z�{�݁j,���k���i�w�Z�{�݁j,�W��,���{�ݎw��̗L��
�x�m�{�s,1,�s����,1,�x�m�{�s�����̈ʒu���߂���,,A-1,,,,1,,,,,,,,,,,,,,,,,,,,,,,,,,,,,,,,,,,,,,,,,,,,,,,,,,1
�x�m�{�s,9,�i���j���������ِ��U�w�Kٰ�,5,,,C-3,,,,1,,,,,,,,,,,,,,,,,,,,,,,,,,,,,,,,,,,,,,,,,,,,,,,,,,
�x�m�{�s,11,�{�{�斯��,4,,,C-4,,,,1,,,,,,,,,,,,,,,,,,,,,,,,,,,,,,,,,,,,,,,,,,,,,,,,,,
�x�m�{�s,13,�i���j�Ő쒆��������,5,,,N-6,,,,1,,,,,,,,,,,,,,,,,,,,,,,,,,,,,,,,,,,,,,,,,,,,,,,,,,
�x�m�{�s,14,�i���j�Ő��ٕ����i�����Ɂj,5,,,N-6,,,,1,,,,,,,,,,,,,,,,,,,,,,,,,,,,,,,,,,,,,,,,,,,,,,,,,,
�x�m�{�s,16,�k�R�o����,5,�x�m�{�s�o�����ݒu���,,A-1,,,,1,,,,,,,,,,,,,,,,,,,,,,,,,,,,,,,,,,,,,,,,,,,,,,,,,,
�x�m�{�s,18,�����o����,5,�x�m�{�s�o�����ݒu���,,A-1,,,,1,,,,,,,,,,,,,,,,,,,,,,,,,,,,,,,,,,,,,,,,,,,,,,,,,,
�x�m�{�s,19,���o����,5,�x�m�{�s�o�����ݒu���,,A-1,,,,1,,,,,,,,,,,,,,,,,,,,,,,,,,,,,,,,,,,,,,,,,,,,,,,,,,
�x�m�{�s,22,�Ő�o�X�Ԍ�,5,,,N-2-1,,,,1,,,,,,,,,,,,,,,,,,,,,,,,,,,,,,,,,,,,,,,,,,,,,,,,,,
�x�m�{�s,23,�Ő�o����,5,�x�m�{�s�o�����ݒu���,,A-1,,,,1,,,,,,,,,,,,,,,,,,,,,,,,,,,,,,,,,,,,,,,,,,,,,,,,,,
�x�m�{�s,25,�w�O�𗬃Z���^�[,4,�x�m�{�s�w�O�𗬃Z���^�[���,,C-1,,,,3,,,,,,,,,,,,,,,,,,,,,,,,,,,,,,,,,,,,,,,,,,,,,,,,,,
�x�m�{�s,27,�����僌�X�g������,5,,,N-6,,,,1,,,,,,,,,,,,,,,,,,,,,,,,,,,,,,,,,,,,,,,,,,,,,,,,,,
�x�m�{�s,28,�l���n�扬���W���,4,,,C-4,,,,1,,,,,,,,,,,,,,,,,,,,,,,,,,,,,,,,,,,,,,,,,,,,,,,,,,
�x�m�{�s,31,�F�v�۔_������,4,,,N-6,,,,1,,,,,,,,,,,,,,,,,,,,,,,,,,,,,,,,,,,,,,,,,,,,,,,,,,
�x�m�{�s,32,����e������,4,,,N-6,,,,1,,,,,,,,,,,,,,,,,,,,,,,,,,,,,,,,,,,,,,,,,,,,,,,,,,
�x�m�{�s,33,�M��̗��������{�݁i�厭�فj,4,,,C-4,,,,3,,,,,,,,,,,,,,,,,,,,,,,,,,,,,,,,,,,,,,,,,,,,,,,,,,
�x�m�{�s,34,�M��n��w�l��ғ��������i�{��,4,,,C-4,,,,1,,,,,,,,,,,,,,,,,,,,,,,,,,,,,,,,,,,,,,,,,,,,,,,,,,
�x�m�{�s,35,���R���_�{��,4,,,C-4,,,,1,,,,,,,,,,,,,,,,,,,,,,,,,,,,,,,,,,,,,,,,,,,,,,,,,,
�x�m�{�s,36,�㒷�є_�ƏW���r�������{��,4,,,B-3-2,,,,1,,,,,,,,,,,,,,,,,,,,,,,,,,,,,,,,,,,,,,,,,,,,,,,,,,
�x�m�{�s,37,�c�ьη���ߏ�,1,,,J-1,,,,3,,,,,,,,,,,,,,,,,,,,,,,,,,,,,,,,,,,,,,,,,,,,,,,,,,
�x�m�{�s,52,�c�ьΐe�����n,5,,,N-6,,,,1,,,,,,,,,,,,,,,,,,,,,,,,,,,,,,,,,,,,,,,,,,,,,,,,,,
�x�m�{�s,53,�c�ь΋����{��,5,,,N-6,,,,1,,,,,,,,,,,,,,,,,,,,,,,,,,,,,,,,,,,,,,,,,,,,,,,,,,
�x�m�{�s,54,�x�m�R�����w������,1,,,J-1,,,,1,,,,,,,,,,,,,,,,,,,,,,,,,,,,,,,,,,,,,,,,,,,,,,,,,,
�x�m�{�s,55,�����̑�ό��ē���,5,,,J-1,,,,,,,,,,,,,,,,,,,,,,,,,,,,,,,,,,,,,,,,,,,,,,,,,,,,,,
�x�m�{�s,56,��h���n��,5,,,N-6,,,,1,,,,,,,,,,,,,,,,,,,,,,,,,,,,,,,,,,,,,,,,,,,,,,,,,,
�x�m�{�s,58,�����@����,5,,,N-6,,,,1,,,,,,,,,,,,,,,,,,,,,,,,,,,,,,,,,,,,,,,,,,,,,,,,,,
�x�m�{�s,59,���̉w��������,1,,,L-1,,,,,,,,,,,,,,,,,,,,,,,,,,,,,,,,,,,,,,,,,,,,,,,,,,,,,,
�x�m�{�s,62,��ԑ�Њό��U�q�{��,5,,,J-1,,,,1,,,,,,,,,,,,,,,,,,,,,,,,,,,,,,,,,,,,,,,,,,,,,,,,,,
�x�m�{�s,63,���R�߹���߰��ό�Ĳ�,5,,,N-3,,,,,,,,,,,,,,,,,,,,,,,,,,,,,,,,,,,,,,,,,,,,,,,,,,,,,,
�x�m�{�s,64,�V��q�쉷��հ�E�ص,1,�x�m�{�s�V��q�쉷�򃆁[�g���I���,,J-1,,,,3,,,,,,,,,,,,,,,,,,,,,,,,,,,,,,,,,,,,,,,,,,,,,,,,,,
�x�m�{�s,72,���q�_���O�ό�Ĳ�,5,,,N-3,,,,,,,,,,,,,,,,,,,,,,,,,,,,,,,,,,,,,,,,,,,,,,,,,,,,,,
�x�m�{�s,73,���q�����ό�Ĳ�,5,,,N-3,,,,,,,,,,,,,,,,,,,,,,,,,,,,,,,,,,,,,,,,,,,,,,,,,,,,,,
�x�m�{�s,74,���[�b�������L��ό�Ĳ�,5,,,N-3,,,,,,,,,,,,,,,,,,,,,,,,,,,,,,,,,,,,,,,,,,,,,,,,,,,,,,
�x�m�{�s,75,��M��M�쏬�O�ό�Ĳ�,5,,,N-3,,,,,,,,,,,,,,,,,,,,,,,,,,,,,,,,,,,,,,,,,,,,,,,,,,,,,,
�x�m�{�s,76,����q�w�O�ό�Ĳ�,5,,,N-3,,,,,,,,,,,,,,,,,,,,,,,,,,,,,,,,,,,,,,,,,,,,,,,,,,,,,,
�x�m�{�s,77,�M������ّO�ό�Ĳ�,5,,,N-3,,,,,,,,,,,,,,,,,,,,,,,,,,,,,,,,,,,,,,,,,,,,,,,,,,,,,,
�x�m�{�s,78,�Ő�w�ό�Ĳ�,5,,,N-3,,,,,,,,,,,,,,,,,,,,,,,,,,,,,,,,,,,,,,,,,,,,,,,,,,,,,,
�x�m�{�s,79,�_�c��ӂꂠ���L��,5,,,J-1,,,,,,,,,,,,,,,,,,,,,,,,,,,,,,,,,,,,,,,,,,,,,,,,,,,,,,
�x�m�{�s,81,�x�m�R�����炬�L��,5,,,J-1,,,,,,,,,,,,,,,,,,,,,,,,,,,,,,,,,,,,,,,,,,,,,,,,,,,,,,
�x�m�{�s,85,�l�����Y�f�����{��,5,,,N-6,,,,1,,,,,,,,,,,,,,,,,,,,,,,,,,,,,,,,,,,,,,,,,,,,,,,,,,
�x�m�{�s,86,�q���v�����g,1,,,B-2,,,,1,,,,,,,,,,,,,,,,,,,,,,,,,,,,,,,,,,,,,,,,,,,,,,,,,,
�x�m�{�s,88,�x�m�R���𗬃v���U,1,,,N-6,,,,,,,,,,,,,,,,,,,,,,,,,,,,,,,,,,,,,,,,,,,,,,,,,,,,,,
�x�m�{�s,89,�ؕ����m�R���Βn,4,,,N-6,,,,,,,,,,,,,,,,,,,,,,,,,,,,,,,,,,,,,,,,,,,,,,,,,,,,,,
�x�m�{�s,90,�ؒc�n����,4,�x�m�{�s�s�s�������,,N-6,,,,,,,,,,,,,,,,,,,,,,,,,,,,,,,,,,,,,,,,,,,,,,,,,,,,,,
�x�m�{�s,91,�������R����,4,,,N-6,,,,,,,,,,,,,,,,,,,,,,,,,,,,,,,,,,,,,,,,,,,,,,,,,,,,,,
�x�m�{�s,93,���q�����,4,�x�m�{�s�s�s�������,,N-6,,,,,,,,,,,,,,,,,,,,,,,,,,,,,,,,,,,,,,,,,,,,,,,,,,,,,,
�x�m�{�s,94,�����߰L��,4,,,N-6,,,,,,,,,,,,,,,,,,,,,,,,,,,,,,,,,,,,,,,,,,,,,,,,,,,,,,
�x�m�{�s,95,�咆������,4,�x�m�{�s�s�s�������,,N-6,,,,,,,,,,,,,,,,,,,,,,,,,,,,,,,,,,,,,,,,,,,,,,,,,,,,,,
�x�m�{�s,96,���o����,4,�x�m�{�s�s�s�������,,N-6,,,,,,,,,,,,,,,,,,,,,,,,,,,,,,,,,,,,,,,,,,,,,,,,,,,,,,
�x�m�{�s,97,���c�ю���,5,,,N-6,,,,,,,,,,,,,,,,,,,,,,,,,,,,,,,,,,,,,,,,,,,,,,,,,,,,,,
�x�m�{�s,98,�}��c����,4,�x�m�{�s�s�s�������,,N-6,,,,,,,,,,,,,,,,,,,,,,,,,,,,,,,,,,,,,,,,,,,,,,,,,,,,,,
�x�m�{�s,99,���o���j�L��,5,,,N-6,,,,,,,,,,,,,,,,,,,,,,,,,,,,,,,,,,,,,,,,,,,,,,,,,,,,,,
�x�m�{�s,100,��{������,4,�x�m�{�s�s�s�������,,N-6,,,,,,,,,,,,,,,,,,,,,,,,,,,,,,,,,,,,,,,,,,,,,,,,,,,,,,
�x�m�{�s,102,�_�c��k����,4,�x�m�{�s�s�s�������,,N-6,,,,,,,,,,,,,,,,,,,,,,,,,,,,,,,,,,,,,,,,,,,,,,,,,,,,,,
�x�m�{�s,103,�_�c������,4,�x�m�{�s�s�s�������,,N-6,,,,,,,,,,,,,,,,,,,,,,,,,,,,,,,,,,,,,,,,,,,,,,,,,,,,,,
�x�m�{�s,104,���c�k����,4,�x�m�{�s�s�s�������,,N-6,,,,,,,,,,,,,,,,,,,,,,,,,,,,,,,,,,,,,,,,,,,,,,,,,,,,,,
�x�m�{�s,105,��������,4,�x�m�{�s�s�s�������,,N-6,,,,,,,,,,,,,,,,,,,,,,,,,,,,,,,,,,,,,,,,,,,,,,,,,,,,,,
�x�m�{�s,106,�����R����,4,�x�m�{�s�s�s�������,,N-6,,,,,,,,,,,,,,,,,,,,,,,,,,,,,,,,,,,,,,,,,,,,,,,,,,,,,,
�x�m�{�s,117,�O�_������,4,�x�m�{�s�s�s�������,,N-6,,,,,,,,,,,,,,,,,,,,,,,,,,,,,,,,,,,,,,,,,,,,,,,,,,,,,,
�x�m�{�s,122,���������k����,4,�x�m�{�s�s�s�������,,N-6,,,,,,,,,,,,,,,,,,,,,,,,,,,,,,,,,,,,,,,,,,,,,,,,,,,,,,
�x�m�{�s,123,��c����,4,,,N-6,,,,,,,,,,,,,,,,,,,,,,,,,,,,,,,,,,,,,,,,,,,,,,,,,,,,,,
�x�m�{�s,125,�����L��,4,,,N-6,,,,,,,,,,,,,,,,,,,,,,,,,,,,,,,,,,,,,,,,,,,,,,,,,,,,,,
�x�m�{�s,126,�V�q�̐X,1,,,J-1,,,,,,,,,,,,,,,,,,,,,,,,,,,,,,,,,,,,,,,,,,,,,,,,,,,,,,
�x�m�{�s,138,�V��R���R����,4,�x�m�{�s�s�s�������,,N-6,,,,,,,,,,,,,,,,,,,,,,,,,,,,,,,,,,,,,,,,,,,,,,,,,,,,,,
�x�m�{�s,142,��������,4,�x�m�{�s�s�s�������,,N-6,,,,,,,,,,,,,,,,,,,,,,,,,,,,,,,,,,,,,,,,,,,,,,,,,,,,,,
�x�m�{�s,144,���m�R��������,4,�x�m�{�s�s�s�������,,N-6,,,,,,,,,,,,,,,,,,,,,,,,,,,,,,,,,,,,,,,,,,,,,,,,,,,,,,
�x�m�{�s,145,�쒆������,4,�x�m�{�s�s�s�������,,N-6,,,,,,,,,,,,,,,,,,,,,,,,,,,,,,,,,,,,,,,,,,,,,,,,,,,,,,
�x�m�{�s,146,��ǌ���,4,�x�m�{�s�s�s�������,,N-6,,,,,,,,,,,,,,,,,,,,,,,,,,,,,,,,,,,,,,,,,,,,,,,,,,,,,,
�x�m�{�s,147,���i�����,4,,,N-6,,,,,,,,,,,,,,,,,,,,,,,,,,,,,,,,,,,,,,,,,,,,,,,,,,,,,,
�x�m�{�s,148,�x�m�R������̉�,5,,,N-6,,,,,,,,,,,,,,,,,,,,,,,,,,,,,,,,,,,,,,,,,,,,,,,,,,,,,,
�x�m�{�s,150,���R�����,4,�x�m�{�s�s�s�������,,N-6,,,,,,,,,,,,,,,,,,,,,,,,,,,,,,,,,,,,,,,,,,,,,,,,,,,,,,
�x�m�{�s,151,�O�c����,4,�x�m�{�s�s�s�������,,N-6,,,,,,,,,,,,,,,,,,,,,,,,,,,,,,,,,,,,,,,,,,,,,,,,,,,,,,
�x�m�{�s,152,���앗���r�c����,4,�x�m�{�s�s�s�������,,N-6,,,,,,,,,,,,,,,,,,,,,,,,,,,,,,,,,,,,,,,,,,,,,,,,,,,,,,
�x�m�{�s,155,�����R����,4,�x�m�{�s�s�s�������,,N-6,,,,,,,,,,,,,,,,,,,,,,,,,,,,,,,,,,,,,,,,,,,,,,,,,,,,,,
�x�m�{�s,168,���c����,4,�x�m�{�s�s�s�������,,N-6,,,,,,,,,,,,,,,,,,,,,,,,,,,,,,,,,,,,,,,,,,,,,,,,,,,,,,
�x�m�{�s,169,�悵�ܒr����,4,,,N-6,,,,,,,,,,,,,,,,,,,,,,,,,,,,,,,,,,,,,,,,,,,,,,,,,,,,,,
�x�m�{�s,170,����k����,4,�x�m�{�s�s�s�������,,N-6,,,,,,,,,,,,,,,,,,,,,,,,,,,,,,,,,,,,,,,,,,,,,,,,,,,,,,
�x�m�{�s,171,���쒆����,4,�x�m�{�s�s�s�������,,N-6,,,,,,,,,,,,,,,,,,,,,,,,,,,,,,,,,,,,,,,,,,,,,,,,,,,,,,
�x�m�{�s,172,��������,4,�x�m�{�s�s�s�������,,N-6,,,,,,,,,,,,,,,,,,,,,,,,,,,,,,,,,,,,,,,,,,,,,,,,,,,,,,
�x�m�{�s,173,���t�����Βn,4,,,N-6,,,,,,,,,,,,,,,,,,,,,,,,,,,,,,,,,,,,,,,,,,,,,,,,,,,,,,
�x�m�{�s,174,�������R����,4,,,N-6,,,,,,,,,,,,,,,,,,,,,,,,,,,,,,,,,,,,,,,,,,,,,,,,,,,,,,
�x�m�{�s,179,�x�m�{����,1,,,N-5,,,,,,,,,,,,,,,,,,,,,,,,,,,,,,,,,,,,,,,,,,,,,,,,,,,,,,
�x�m�{�s,182,�x�m�R�V��̓�,1,,,J-1,,,,3,,,,,,,,,,,,,,,,,,,,,,,,,,,,,,,,,,,,,,,,,,,,,,,,,,
�x�m�{�s,184,���X�ؕ�n,1,,,N-4,,,,,,,,,,,,,,,,,,,,,,,,,,,,,,,,,,,,,,,,,,,,,,,,,,,,,,
�x�m�{�s,185,���|�Z���^�[,1,,,B-1,,,,1,,,,,,,,,,,,,,,,,,,,,,,,,,,,,,,,,,,,,,,,,,,,,,,,,,
�x�m�{�s,199,�ƍ���ŏI������,1,,,B-1,,,,1,,,,,,,,,,,,,,,,,,,,,,,,,,,,,,,,,,,,,,,,,,,,,,,,,,
�x�m�{�s,206,������,1,�V�l�����@��15���3��,,F-3,,,,3,,,,,,,,,,,,,,,,,,,,,,,,,,,,,,,,,,,,,,,,,,,50,50,,,,,,
�x�m�{�s,215,�x�m���ۈ牀,3,���������@��Q�S��,,E-1,,,,1,,,,,,,,,,,,,,,,,,,,,,,,,,,,,,,,,,,,,,,,,,,,,120,131,,,,
�x�m�{�s,217,��▾�ϕۈ牀,3,���������@��Q�S��,,E-1,,,,1,,,,,,,,,,,,,,,,,,,,,,,,,,,,,,,,,,,,,,,,,,,,,90,100,,,,
�x�m�{�s,218,��x�m�ۈ牀,3,���������@��Q�S��,,E-1,,,,1,,,,,,,,,,,,,,,,,,,,,,,,,,,,,,,,,,,,,,,,,,,,,90,89,,,,
�x�m�{�s,222,�k�R�ۈ牀,3,���������@��Q�S��,,E-1,,,,1,,,,,,,,,,,,,,,,,,,,,,,,,,,,,,,,,,,,,,,,,,,,,90,73,,,,
�x�m�{�s,223,���o�ۈ牀,3,���������@��Q�S��,,E-1,,,,1,,,,,,,,,,,,,,,,,,,,,,,,,,,,,,,,,,,,,,,,,,,,,90,53,,,,
�x�m�{�s,224,�����ۈ牀,3,���������@��Q�S��,,E-1,,,,1,,,,,,,,,,,,,,,,,,,,,,,,,,,,,,,,,,,,,,,,,,,,,60,33,,,,
�x�m�{�s,227,�R�{�ۈ牀,3,���������@��Q�S��,,E-1,,,,1,,,,,,,,,,,,,,,,,,,,,,,,,,,,,,,,,,,,,,,,,,,,,90,82,,,,
�x�m�{�s,231,��{�ۈ牀,3,���������@��Q�S��,,E-1,,,,1,,,,,,,,,,,,,,,,,,,,,,,,,,,,,,,,,,,,,,,,,,,,,150,147,,,,
�x�m�{�s,235,��V���ۈ牀,3,���������@��Q�S��,,E-1,,,,1,,,,,,,,,,,,,,,,,,,,,,,,,,,,,,,,,,,,,,,,,,,,,45,29,,,,
�x�m�{�s,236,���ۈ牀,3,���������@��Q�S��,,E-1,,,,1,,,,,,,,,,,,,,,,,,,,,,,,,,,,,,,,,,,,,,,,,,,,,120,98,,,,
�x�m�{�s,237,���q�ۈ牀,3,���������@��Q�S��,,E-1,,,,1,,,,,,,,,,,,,,,,,,,,,,,,,,,,,,,,,,,,,,,,,,,,,90,75,,,,
�x�m�{�s,238,�����ۈ牀,3,���������@��Q�S��,,E-1,,,,1,,,,,,,,,,,,,,,,,,,,,,,,,,,,,,,,,,,,,,,,,,,,,90,84,,,,
�x�m�{�s,239,��⎙���V���n,4,,,N-6,,,,,,,,,,,,,,,,,,,,,,,,,,,,,,,,,,,,,,,,,,,,,,,,,,,,,,
�x�m�{�s,240,���c��1�����N���u,3,���������@��6��3�̑�2��,,E-3,,,,1,,,,,,,,,,,,,,,,,,,,,,,,,,,,,,,,,,,,,,,,,,,,,,42,,,,
�x�m�{�s,242,�Ȃ��悵���������ގ�,3,���������@��6��3�̑�2��,,E-3,,,,1,,,,,,,,,,,,,,,,,,,,,,,,,,,,,,,,,,,,,,,,,,,,,,27,,,,
�x�m�{�s,243,�k�R��������,3,���������@��6��3�̑�2��,,E-3,,,,1,,,,,,,,,,,,,,,,,,,,,,,,,,,,,,,,,,,,,,,,,,,,,,40,,,,
�x�m�{�s,244,���o��������,3,���������@��6��3�̑�2��,,E-3,,,,1,,,,,,,,,,,,,,,,,,,,,,,,,,,,,,,,,,,,,,,,,,,,,,28,,,,
�x�m�{�s,245,�����̎q��������,3,���������@��6��3�̑�2��,,E-3,,,,1,,,,,,,,,,,,,,,,,,,,,,,,,,,,,,,,,,,,,,,,,,,,,,11,,,,
�x�m�{�s,246,��܂т���������,3,���������@��6��3�̑�2��,,E-3,,,,1,,,,,,,,,,,,,,,,,,,,,,,,,,,,,,,,,,,,,,,,,,,,,,27,,,,
�x�m�{�s,247,�R�{��������,3,���������@��6��3�̑�2��,,E-3,,,,1,,,,,,,,,,,,,,,,,,,,,,,,,,,,,,,,,,,,,,,,,,,,,,24,,,,
�x�m�{�s,248,��̂��q��������,3,���������@��6��3�̑�2��,,E-3,,,,1,,,,,,,,,,,,,,,,,,,,,,,,,,,,,,,,,,,,,,,,,,,,,,10,,,,
�x�m�{�s,250,������������,3,���������@��6��3�̑�2��,,E-3,,,,1,,,,,,,,,,,,,,,,,,,,,,,,,,,,,,,,,,,,,,,,,,,,,,26,,,,
�x�m�{�s,251,�M��ۈ牀,3,���������@��Q�S��,,E-1,,,,1,,,,,,,,,,,,,,,,,,,,,,,,,,,,,,,,,,,,,,,,,,,,,90,28,,,,
�x�m�{�s,254,�È�x���Z���^�[,1,�x�m�{�s�������B�x���Z���^�[���,,E-7,,,,1,,,,,,,,,,,,,,,,,,,,,,,,,,,,,,,,,,,,,,,,,,,,,,,,,,
�x�m�{�s,255,�����Ȃ뉀,1,�x�m�{�s�������B�x���Z���^�[���,,E-7,,,,1,,,,,,,,,,,,,,,,,,,,,,,,,,,,,,,,,,,,,,,,,,,,,,,,,,
�x�m�{�s,256,�x�m�{�w�쎩�]�ԓ����ԏ�,5,,,N-2-1,,,,1,,,,,,,,,,,,,,,,,,,,,,,,,,,,,,,,,,,,,,,,,,,,,,,,,,
�x�m�{�s,259,�s���ђ�1�������̉��f�{��,5,,,N-6,,,,1,,,,,,,,,,,,,,,,,,,,,,,,,,,,,,,,,,,,,,,,,,,,,,,,,,
�x�m�{�s,260,�s���w�O�����������̉��f�{��,5,,,N-6,,,,1,,,,,,,,,,,,,,,,,,,,,,,,,,,,,,,,,,,,,,,,,,,,,,,,,,
�x�m�{�s,261,��܂ƌא��������q�Ɂi�k�j,5,,,N-6,,,,1,,,,,,,,,,,,,,,,,,,,,,,,,,,,,,,,,,,,,,,,,,,,,,,,,,
�x�m�{�s,263,���E�r���p���ޑq��,5,,,N-6,,,,1,,,,,,,,,,,,,,,,,,,,,,,,,,,,,,,,,,,,,,,,,,,,,,,,,,
�x�m�{�s,264,���ӂ̊y�Z,5,,,N-6,,,,,,,,,,,,,,,,,,,,,,,,,,,,,,,,,,,,,,,,,,,,,,,,,,,,,,
�x�m�{�s,267,�������w�k���]�ԓ����ԏ�,5,,,N-2-1,,,,1,,,,,,,,,,,,,,,,,,,,,,,,,,,,,,,,,,,,,,,,,,,,,,,,,,
�x�m�{�s,275,�����Z��,5,�x�m�{�s�c�Z����,,K-1,,,,1,,,,,,,,,,,,,,,,,,,,,,,,,,,,,,,,,,,,,,,,,,,142,123,,,,,,
�x�m�{�s,295,���̗֏Z��,5,�x�m�{�s�c�Z����,,K-1,,,,1,,,,,,,,,,,,,,,,,,,,,,,,,,,,,,,,,,,,,,,,,,,96,58,,,,,,
�x�m�{�s,313,����Z��,5,�x�m�{�s�c�Z����,,K-1,,,,1,,,,,,,,,,,,,,,,,,,,,,,,,,,,,,,,,,,,,,,,,,,13,12,,,,,,
�x�m�{�s,318,�㏬��Z��,5,�x�m�{�s�c�Z����,,K-1,,,,1,,,,,,,,,,,,,,,,,,,,,,,,,,,,,,,,,,,,,,,,,,,11,9,,,,,,
�x�m�{�s,322,�x�m�����u�Z��,5,�x�m�{�s�c�Z����,,K-1,,,,1,,,,,,,,,,,,,,,,,,,,,,,,,,,,,,,,,,,,,,,,,,,72,55,,,,,,
�x�m�{�s,340,������Z��,5,�x�m�{�s�c�Z����,,K-1,,,,1,,,,,,,,,,,,,,,,,,,,,,,,,,,,,,,,,,,,,,,,,,,14,13,,,,,,
�x�m�{�s,381,����Z��,5,�x�m�{�s�c�Z����,,K-1,,,,1,,,,,,,,,,,,,,,,,,,,,,,,,,,,,,,,,,,,,,,,,,,62,58,,,,,,
�x�m�{�s,384,���Z��,5,�x�m�{�s�c�Z����,,K-1,,,,1,,,,,,,,,,,,,,,,,,,,,,,,,,,,,,,,,,,,,,,,,,,30,6,,,,,,
�x�m�{�s,393,���q�Z��,5,�x�m�{�s�c�Z����,,K-1,,,,1,,,,,,,,,,,,,,,,,,,,,,,,,,,,,,,,,,,,,,,,,,,250,145,,,,,,
�x�m�{�s,443,���`�z���r,5,,,N-6,,,,1,,,,,,,,,,,,,,,,,,,,,,,,,,,,,,,,,,,,,,,,,,,,,,,,,,
�x�m�{�s,444,���q����,5,,,N-6,,,,1,,,,,,,,,,,,,,,,,,,,,,,,,,,,,,,,,,,,,,,,,,,,,,,,,,
�x�m�{�s,446,��V����Q�z���r,5,,,N-6,,,,1,,,,,,,,,,,,,,,,,,,,,,,,,,,,,,,,,,,,,,,,,,,,,,,,,,
�x�m�{�s,450,�咆����1�z���r,5,,,N-6,,,,1,,,,,,,,,,,,,,,,,,,,,,,,,,,,,,,,,,,,,,,,,,,,,,,,,,
�x�m�{�s,452,�咆����2�z���r,5,,,N-6,,,,1,,,,,,,,,,,,,,,,,,,,,,,,,,,,,,,,,,,,,,,,,,,,,,,,,,
�x�m�{�s,454,��{����,5,,,N-6,,,,1,,,,,,,,,,,,,,,,,,,,,,,,,,,,,,,,,,,,,,,,,,,,,,,,,,
�x�m�{�s,456,���o�z���r,5,,,N-6,,,,1,,,,,,,,,,,,,,,,,,,,,,,,,,,,,,,,,,,,,,,,,,,,,,,,,,
�x�m�{�s,457,�k�R�򐅏�,5,,,N-6,,,,1,,,,,,,,,,,,,,,,,,,,,,,,,,,,,,,,,,,,,,,,,,,,,,,,,,
�x�m�{�s,461,�k�R��P�z���r,5,,,N-6,,,,1,,,,,,,,,,,,,,,,,,,,,,,,,,,,,,,,,,,,,,,,,,,,,,,,,,
�x�m�{�s,463,���c�z���r,5,,,N-6,,,,1,,,,,,,,,,,,,,,,,,,,,,,,,,,,,,,,,,,,,,,,,,,,,,,,,,
�x�m�{�s,464,����z���r,5,,,N-6,,,,1,,,,,,,,,,,,,,,,,,,,,,,,,,,,,,,,,,,,,,,,,,,,,,,,,,
�x�m�{�s,467,���c��P����,5,,,N-6,,,,1,,,,,,,,,,,,,,,,,,,,,,,,,,,,,,,,,,,,,,,,,,,,,,,,,,
�x�m�{�s,468,���c��1�z���r,5,,,N-6,,,,1,,,,,,,,,,,,,,,,,,,,,,,,,,,,,,,,,,,,,,,,,,,,,,,,,,
�x�m�{�s,469,���c��2����,5,,,N-6,,,,1,,,,,,,,,,,,,,,,,,,,,,,,,,,,,,,,,,,,,,,,,,,,,,,,,,
�x�m�{�s,470,�狏�����r,5,,,N-6,,,,1,,,,,,,,,,,,,,,,,,,,,,,,,,,,,,,,,,,,,,,,,,,,,,,,,,
�x�m�{�s,471,�֑򐅌�,5,,,N-6,,,,1,,,,,,,,,,,,,,,,,,,,,,,,,,,,,,,,,,,,,,,,,,,,,,,,,,
�x�m�{�s,472,�����z���r,5,,,N-6,,,,1,,,,,,,,,,,,,,,,,,,,,,,,,,,,,,,,,,,,,,,,,,,,,,,,,,
�x�m�{�s,473,�ъԐ���,5,,,N-6,,,,1,,,,,,,,,,,,,,,,,,,,,,,,,,,,,,,,,,,,,,,,,,,,,,,,,,
�x�m�{�s,474,�쒆�z���r,5,,,N-6,,,,1,,,,,,,,,,,,,,,,,,,,,,,,,,,,,,,,,,,,,,,,,,,,,,,,,,
�x�m�{�s,475,���R�z���r,5,,,N-6,,,,1,,,,,,,,,,,,,,,,,,,,,,,,,,,,,,,,,,,,,,,,,,,,,,,,,,
�x�m�{�s,476,���R����ߏ�,5,,,N-6,,,,1,,,,,,,,,,,,,,,,,,,,,,,,,,,,,,,,,,,,,,,,,,,,,,,,,,
�x�m�{�s,477,�x�V���z���r,5,,,N-6,,,,1,,,,,,,,,,,,,,,,,,,,,,,,,,,,,,,,,,,,,,,,,,,,,,,,,,
�x�m�{�s,479,����z���r,5,,,N-6,,,,1,,,,,,,,,,,,,,,,,,,,,,,,,,,,,,,,,,,,,,,,,,,,,,,,,,
�x�m�{�s,480,��������,5,,,N-6,,,,1,,,,,,,,,,,,,,,,,,,,,,,,,,,,,,,,,,,,,,,,,,,,,,,,,,
�x�m�{�s,483,�{����Q�z���r,5,,,N-6,,,,1,,,,,,,,,,,,,,,,,,,,,,,,,,,,,,,,,,,,,,,,,,,,,,,,,,
�x�m�{�s,484,�{���z���r,5,,,N-6,,,,1,,,,,,,,,,,,,,,,,,,,,,,,,,,,,,,,,,,,,,,,,,,,,,,,,,
�x�m�{�s,486,���R����,5,,,N-6,,,,1,,,,,,,,,,,,,,,,,,,,,,,,,,,,,,,,,,,,,,,,,,,,,,,,,,
�x�m�{�s,487,����z���r,5,,,N-6,,,,1,,,,,,,,,,,,,,,,,,,,,,,,,,,,,,,,,,,,,,,,,,,,,,,,,,
�x�m�{�s,488,���t�z���r,5,,,N-6,,,,1,,,,,,,,,,,,,,,,,,,,,,,,,,,,,,,,,,,,,,,,,,,,,,,,,,
�x�m�{�s,490,�����z���r,5,,,N-6,,,,1,,,,,,,,,,,,,,,,,,,,,,,,,,,,,,,,,,,,,,,,,,,,,,,,,,
�x�m�{�s,491,��{�z���r,5,,,N-6,,,,1,,,,,,,,,,,,,,,,,,,,,,,,,,,,,,,,,,,,,,,,,,,,,,,,,,
�x�m�{�s,493,���R�򉻃Z���^�[,1,,,B-3-2,,,,1,,,,,,,,,,,,,,,,,,,,,,,,,,,,,,,,,,,,,,,,,,,,,,,,,,
�x�m�{�s,498,�R�{����ߏ�,5,,,B-2,,,,1,,,,,,,,,,,,,,,,,,,,,,,,,,,,,,,,,,,,,,,,,,,,,,,,,,
�x�m�{�s,499,���R�Z��c�n����������,5,,,B-3-2,,,,1,,,,,,,,,,,,,,,,,,,,,,,,,,,,,,,,,,,,,,,,,,,,,,,,,,
�x�m�{�s,500,�������h��,5,�x�m�{�s���h�{���y�я��h���̐ݒu���Ɋւ�����,,A-2,,,,1,,,,,,,,,,,,,,,,,,,,,,,,,,,,,,,,,,,,,,,,,,,,,,,,,,
�x�m�{�s,501,�����h��,5,�x�m�{�s���h�{���y�я��h���̐ݒu���Ɋւ�����,,A-2,,,,1,,,,,,,,,,,,,,,,,,,,,,,,,,,,,,,,,,,,,,,,,,,,,,,,,,
�x�m�{�s,502,�������h���Ő앪��,5,�x�m�{�s���h�{���y�я��h���̐ݒu���Ɋւ�����,,A-2,,,,1,,,,,,,,,,,,,,,,,,,,,,,,,,,,,,,,,,,,,,,,,,,,,,,,,,
�x�m�{�s,505,�������h��������,5,�x�m�{�s���h�{���y�я��h���̐ݒu���Ɋւ�����,,A-2,,,,1,,,,,,,,,,,,,,,,,,,,,,,,,,,,,,,,,,,,,,,,,,,,,,,,,,
�x�m�{�s,506,�����h����앪��,5,�x�m�{�s���h�{���y�я��h���̐ݒu���Ɋւ�����,,A-2,,,,1,,,,,,,,,,,,,,,,,,,,,,,,,,,,,,,,,,,,,,,,,,,,,,,,,,
�x�m�{�s,507,��1���c�l��,4,�x�m�{�s���h�c�̑g�D���Ɋւ���K��,,A-2,,,,1,,,,,,,,,,,,,,,,,,,,,,,,,,,,,,,,,,,,,,,,,,,,,,,,,,
�x�m�{�s,508,��2���c�l��,4,�x�m�{�s���h�c�̑g�D���Ɋւ���K��,,A-2,,,,1,,,,,,,,,,,,,,,,,,,,,,,,,,,,,,,,,,,,,,,,,,,,,,,,,,
�x�m�{�s,509,��3���c�l��,4,�x�m�{�s���h�c�̑g�D���Ɋւ���K��,,A-2,,,,1,,,,,,,,,,,,,,,,,,,,,,,,,,,,,,,,,,,,,,,,,,,,,,,,,,
�x�m�{�s,510,��4���c�l��,4,�x�m�{�s���h�c�̑g�D���Ɋւ���K��,,A-2,,,,1,,,,,,,,,,,,,,,,,,,,,,,,,,,,,,,,,,,,,,,,,,,,,,,,,,
�x�m�{�s,511,��5���c�l��,4,�x�m�{�s���h�c�̑g�D���Ɋւ���K��,,A-2,,,,1,,,,,,,,,,,,,,,,,,,,,,,,,,,,,,,,,,,,,,,,,,,,,,,,,,
�x�m�{�s,512,��6���c�l���i�؁j,4,�x�m�{�s���h�c�̑g�D���Ɋւ���K��,,A-2,,,,1,,,,,,,,,,,,,,,,,,,,,,,,,,,,,,,,,,,,,,,,,,,,,,,,,,
�x�m�{�s,513,��6���c�l���i�O�_�j,4,�x�m�{�s���h�c�̑g�D���Ɋւ���K��,,A-2,,,,1,,,,,,,,,,,,,,,,,,,,,,,,,,,,,,,,,,,,,,,,,,,,,,,,,,
�x�m�{�s,514,��6���c�l���i���t�j,4,�x�m�{�s���h�c�̑g�D���Ɋւ���K��,,A-2,,,,1,,,,,,,,,,,,,,,,,,,,,,,,,,,,,,,,,,,,,,,,,,,,,,,,,,
�x�m�{�s,515,��7���c�l��,4,�x�m�{�s���h�c�̑g�D���Ɋւ���K��,,A-2,,,,1,,,,,,,,,,,,,,,,,,,,,,,,,,,,,,,,,,,,,,,,,,,,,,,,,,
�x�m�{�s,516,��8���c�l��,4,�x�m�{�s���h�c�̑g�D���Ɋւ���K��,,A-2,,,,1,,,,,,,,,,,,,,,,,,,,,,,,,,,,,,,,,,,,,,,,,,,,,,,,,,
�x�m�{�s,517,��9���c�l��,4,�x�m�{�s���h�c�̑g�D���Ɋւ���K��,,A-2,,,,1,,,,,,,,,,,,,,,,,,,,,,,,,,,,,,,,,,,,,,,,,,,,,,,,,,
�x�m�{�s,518,��10���c�l���i�����R�j,4,�x�m�{�s���h�c�̑g�D���Ɋւ���K��,,A-2,,,,1,,,,,,,,,,,,,,,,,,,,,,,,,,,,,,,,,,,,,,,,,,,,,,,,,,
�x�m�{�s,519,��10���c�l���i���v�ہj,4,�x�m�{�s���h�c�̑g�D���Ɋւ���K��,,A-2,,,,1,,,,,,,,,,,,,,,,,,,,,,,,,,,,,,,,,,,,,,,,,,,,,,,,,,
�x�m�{�s,520,��11���c�l���i�ьˁj,4,�x�m�{�s���h�c�̑g�D���Ɋւ���K��,,A-2,,,,1,,,,,,,,,,,,,,,,,,,,,,,,,,,,,,,,,,,,,,,,,,,,,,,,,,
�x�m�{�s,521,��11���c�l���i���c�j,4,�x�m�{�s���h�c�̑g�D���Ɋւ���K��,,A-2,,,,1,,,,,,,,,,,,,,,,,,,,,,,,,,,,,,,,,,,,,,,,,,,,,,,,,,
�x�m�{�s,522,��11���c�l���i���R�j,4,�x�m�{�s���h�c�̑g�D���Ɋւ���K��,,A-2,,,,1,,,,,,,,,,,,,,,,,,,,,,,,,,,,,,,,,,,,,,,,,,,,,,,,,,
�x�m�{�s,523,��12���c�l���i�R�{�j,4,�x�m�{�s���h�c�̑g�D���Ɋւ���K��,,A-2,,,,1,,,,,,,,,,,,,,,,,,,,,,,,,,,,,,,,,,,,,,,,,,,,,,,,,,
�x�m�{�s,524,��12���c�l���i����j,4,�x�m�{�s���h�c�̑g�D���Ɋւ���K��,,A-2,,,,1,,,,,,,,,,,,,,,,,,,,,,,,,,,,,,,,,,,,,,,,,,,,,,,,,,
�x�m�{�s,525,��13���c�l��,4,�x�m�{�s���h�c�̑g�D���Ɋւ���K��,,A-2,,,,1,,,,,,,,,,,,,,,,,,,,,,,,,,,,,,,,,,,,,,,,,,,,,,,,,,
�x�m�{�s,526,��14���c�l���i����j,4,�x�m�{�s���h�c�̑g�D���Ɋւ���K��,,A-2,,,,1,,,,,,,,,,,,,,,,,,,,,,,,,,,,,,,,,,,,,,,,,,,,,,,,,,
�x�m�{�s,527,��14���c�l���i���j,4,�x�m�{�s���h�c�̑g�D���Ɋւ���K��,,A-2,,,,1,,,,,,,,,,,,,,,,,,,,,,,,,,,,,,,,,,,,,,,,,,,,,,,,,,
�x�m�{�s,528,��15���c�l���i�񖔁j,4,�x�m�{�s���h�c�̑g�D���Ɋւ���K��,,A-2,,,,1,,,,,,,,,,,,,,,,,,,,,,,,,,,,,,,,,,,,,,,,,,,,,,,,,,
�x�m�{�s,530,��15���c�l���i���R�j,4,�x�m�{�s���h�c�̑g�D���Ɋւ���K��,,A-2,,,,1,,,,,,,,,,,,,,,,,,,,,,,,,,,,,,,,,,,,,,,,,,,,,,,,,,
�x�m�{�s,531,��16���c�l��,4,�x�m�{�s���h�c�̑g�D���Ɋւ���K��,,A-2,,,,1,,,,,,,,,,,,,,,,,,,,,,,,,,,,,,,,,,,,,,,,,,,,,,,,,,
�x�m�{�s,532,��17���c�l���i��g�j,4,�x�m�{�s���h�c�̑g�D���Ɋւ���K��,,A-2,,,,1,,,,,,,,,,,,,,,,,,,,,,,,,,,,,,,,,,,,,,,,,,,,,,,,,,
�x�m�{�s,536,��18���c�l���i�n���ˁj,4,�x�m�{�s���h�c�̑g�D���Ɋւ���K��,,A-2,,,,1,,,,,,,,,,,,,,,,,,,,,,,,,,,,,,,,,,,,,,,,,,,,,,,,,,
�x�m�{�s,538,���i�쐅�h�q��,4,,,A-2,,,,1,,,,,,,,,,,,,,,,,,,,,,,,,,,,,,,,,,,,,,,,,,,,,,,,,,
�x�m�{�s,539,��19���c�l���i���@���j,4,,,A-2,,,,1,,,,,,,,,,,,,,,,,,,,,,,,,,,,,,,,,,,,,,,,,,,,,,,,,,
�x�m�{�s,540,��20���c�l���i�l���j,4,,,A-2,,,,1,,,,,,,,,,,,,,,,,,,,,,,,,,,,,,,,,,,,,,,,,,,,,,,,,,
�x�m�{�s,544,��20���c�l���i���o�j,4,,,A-2,,,,1,,,,,,,,,,,,,,,,,,,,,,,,,,,,,,,,,,,,,,,,,,,,,,,,,,
�x�m�{�s,545,��21���c�l���i�[�j,4,,,A-2,,,,1,,,,,,,,,,,,,,,,,,,,,,,,,,,,,,,,,,,,,,,,,,,,,,,,,,
�x�m�{�s,552,��21���c�l���i���V���j,4,,,A-2,,,,1,,,,,,,,,,,,,,,,,,,,,,,,,,,,,,,,,,,,,,,,,,,,,,,,,,
�x�m�{�s,553,��22���c�l���i���j,4,,,A-2,,,,1,,,,,,,,,,,,,,,,,,,,,,,,,,,,,,,,,,,,,,,,,,,,,,,,,,
�x�m�{�s,560,��23���c�l��,4,�x�m�{�s���h�c�̑g�D���Ɋւ���K��,,A-2,,,,1,,,,,,,,,,,,,,,,,,,,,,,,,,,,,,,,,,,,,,,,,,,,,,,,,,
�x�m�{�s,561,��24���c�l��,4,�x�m�{�s���h�c�̑g�D���Ɋւ���K��,,A-2,,,,1,,,,,,,,,,,,,,,,,,,,,,,,,,,,,,,,,,,,,,,,,,,,,,,,,,
�x�m�{�s,562,��25���c�l��,4,�x�m�{�s���h�c�̑g�D���Ɋւ���K��,,A-2,,,,1,,,,,,,,,,,,,,,,,,,,,,,,,,,,,,,,,,,,,,,,,,,,,,,,,,
�x�m�{�s,563,��26���c�l��,4,�x�m�{�s���h�c�̑g�D���Ɋւ���K��,,A-2,,,,1,,,,,,,,,,,,,,,,,,,,,,,,,,,,,,,,,,,,,,,,,,,,,,,,,,
�x�m�{�s,564,��27���c�l��,4,�x�m�{�s���h�c�̑g�D���Ɋւ���K��,,A-2,,,,1,,,,,,,,,,,,,,,,,,,,,,,,,,,,,,,,,,,,,,,,,,,,,,,,,,
�x�m�{�s,565,��28���c�l��,4,�x�m�{�s���h�c�̑g�D���Ɋւ���K��,,A-2,,,,1,,,,,,,,,,,,,,,,,,,,,,,,,,,,,,,,,,,,,,,,,,,,,,,,,,
�x�m�{�s,566,���o���h�q��,4,,,A-2,,,,1,,,,,,,,,,,,,,,,,,,,,,,,,,,,,,,,,,,,,,,,,,,,,,,,,,
�x�m�{�s,567,��h���h�q��,4,,,A-2,,,,1,,,,,,,,,,,,,,,,,,,,,,,,,,,,,,,,,,,,,,,,,,,,,,,,,,
�x�m�{�s,568,����q��,4,,,A-2,,,,1,,,,,,,,,,,,,,,,,,,,,,,,,,,,,,,,,,,,,,,,,,,,,,,,,,
�x�m�{�s,569,�x�u���@�ޑq��,4,,,A-2,,,,1,,,,,,,,,,,,,,,,,,,,,,,,,,,,,,,,,,,,,,,,,,,,,,,,,,
�x�m�{�s,570,���t���h�q��,4,,,A-2,,,,1,,,,,,,,,,,,,,,,,,,,,,,,,,,,,,,,,,,,,,,,,,,,,,,,,,
�x�m�{�s,571,�����w�Z,3,�w�Z����@��R�W��,,D-4,,,,1,,,,,,,,,,,,,,,,,,,,,,,,,,,,,,,,,,,,,,,,,,,,,,,18,561,,4
�x�m�{�s,585,���c���w�Z,3,�w�Z����@��R�W��,,D-4,,,,1,,,,,,,,,,,,,,,,,,,,,,,,,,,,,,,,,,,,,,,,,,,,,,,22,633,,4
�x�m�{�s,595,��{���w�Z,3,�w�Z����@��R�W��,,D-4,,,,1,,,,,,,,,,,,,,,,,,,,,,,,,,,,,,,,,,,,,,,,,,,,,,,22,443,,4
�x�m�{�s,605,�M�D���w�Z,3,�w�Z����@��R�W��,,D-4,,,,1,,,,,,,,,,,,,,,,,,,,,,,,,,,,,,,,,,,,,,,,,,,,,,,22,559,,4
�x�m�{�s,621,�x�u���w�Z,3,�w�Z����@��R�W��,,D-4,,,,1,,,,,,,,,,,,,,,,,,,,,,,,,,,,,,,,,,,,,,,,,,,,,,,26,781,,4
�x�m�{�s,633,��x�m���w�Z,3,�w�Z����@��R�W��,,D-4,,,,1,,,,,,,,,,,,,,,,,,,,,,,,,,,,,,,,,,,,,,,,,,,,,,,30,910,,4
�x�m�{�s,651,�x�m���쏬�w�Z,3,�w�Z����@��R�W��,,D-4,,,,1,,,,,,,,,,,,,,,,,,,,,,,,,,,,,,,,,,,,,,,,,,,,,,,38,1078,,4
�x�m�{�s,678,�x�m���k���w�Z,3,�w�Z����@��R�W��,,D-4,,,,1,,,,,,,,,,,,,,,,,,,,,,,,,,,,,,,,,,,,,,,,,,,,,,,8,171,,4
�x�m�{�s,680,�x�m���k���w�Z���q���Z,3,�w�Z����@��R�W��,,D-4,,,,1,,,,,,,,,,,,,,,,,,,,,,,,,,,,,,,,,,,,,,,,,,,,,,,2,6,,4
�x�m�{�s,684,�R�{���w�Z,3,�w�Z����@��R�W��,,D-4,,,,1,,,,,,,,,,,,,,,,,,,,,,,,,,,,,,,,,,,,,,,,,,,,,,,6,158,,4
�x�m�{�s,694,�k�R���w�Z,3,�w�Z����@��R�W��,,D-4,,,,1,,,,,,,,,,,,,,,,,,,,,,,,,,,,,,,,,,,,,,,,,,,,,,,9,176,,4
�x�m�{�s,704,���o���w�Z,3,�w�Z����@��R�W��,,D-4,,,,1,,,,,,,,,,,,,,,,,,,,,,,,,,,,,,,,,,,,,,,,,,,,,,,6,75,,4
�x�m�{�s,714,�l�����w�Z,3,�w�Z����@��R�W��,,D-4,,,,1,,,,,,,,,,,,,,,,,,,,,,,,,,,,,,,,,,,,,,,,,,,,,,,3,19,,4