�s���{���R�[�h���͎s�撬���R�[�h,NO,�s���{����,�s�撬����,�c�Ə�����,�c�Ə�����_�J�i,�c�Ƃ̎��,�Ƒ�,�c�Ə����ݒn,�c�Ə�����,�ܓx,�o�x,�c�Ə��d�b�ԍ�,�@�l��,�@�l�ԍ�,���ԍ�,���񋖉N����,���N����,���J�n��,��������,�p�ƔN����,�\���敪,������,���l
220001,1,�É���,,�T�E�X�t�@�[��,,�H��������,,���c�s���l�R�P�S�R�|�S�U,,,,,�����@����,,,,2020-2-4,,,,,,
220001,2,�É���,,�p����,,�َq������,,���c�s�g�����Q�Q�S�T�|�P,,,,,�K�c���q,,,,2020-2-6,,,,,,
220001,3,�É���,,�_�b�N,,���H�X�c��,�H��,��ΌS�͒Ò����P��P�X�Q�|�P,,,,,����m��,,,,2020-2-12,,,,,,
220001,4,�É���,,���炵�̗��ޗǖ{,,�َq������,,��ΌS���ɓ����ޗǖ{�T�O�|�P,,,,,�y���@�ӂݎq,,,,2020-2-12,,,,,,
220001,5,�É���,,�Z�u���C���u�����c���l�X,,���H�X�c��,�H��,���c�s���l�Q�V�R�Q�|�V,,,,,�����h��,,,,2020-2-25,,,,,,
220001,6,�É���,,�Z�u���C���u�����c���l�X,,�H���̔���,��H��,���c�s���l�Q�V�R�Q�|�V,,,,,�����h��,,,,2020-2-25,,,,,,
220001,7,�É���,,�Z�u���C���u�����c���l�X,,���ޔ̔���,,���c�s���l�Q�V�R�Q�|�V,,,,,�����h��,,,,2020-2-25,,,,,,
220001,8,�É���,,�Z�u���C���u�����c���l�X,,�َq������,,���c�s���l�Q�V�R�Q�|�V,,,,,�����h��,,,,2020-2-25,,,,,,
220001,9,�É���,,���[�\�����c�܂��܂��ʂ�X,,���H�X�c��,�H��,���c�s�꒚�ڂP�W�|�Q�T,,,,,��؁@���,,,,2020-2-26,,,,,,
220001,10,�É���,,���[�\�����c�܂��܂��ʂ�X,,�َq������,,���c�s�꒚�ڂP�W�|�Q�T,,,,,��؁@���,,,,2020-2-26,,,,,,
220001,11,�É���,,���[�\�����c�܂��܂��ʂ�X,,���ޔ̔���,,���c�s�꒚�ڂP�W�|�Q�T,,,,,��؁@���,,,,2020-2-26,,,,,,
220001,12,�É���,,���[�\�����c�܂��܂��ʂ�X,,����ޔ̔���,������,���c�s�꒚�ڂP�W�|�Q�T,,,,,��؁@���,,,,2020-2-26,,,,,,
220001,13,�É���,,���[�\�����c�܂��܂��ʂ�X,,�H���̔���,��H��,���c�s�꒚�ڂP�W�|�Q�T,,,,,��؁@���,,,,2020-2-26,,,,,,
220001,14,�É���,,�V�R����̏h�@�����̖�,,���H�X�c��,�ȈՏh��,�ɓ��s�x�˂Q�U�U�|�R,,,,,�n糁@����,,,,2020-2-6,,,,,,
220001,15,�É���,,�j�������������@�a������,,���H�X�c��,�d�o����,�ɓ��s��{�����a�c�V�P�U�|�U�X,,,,,��؁@��,,,,2020-2-12,,,,,,
220001,16,�É���,,���y�I���Ɓ@�N���b�v�X,,���H�X�c��,�H��,�ɓ��s�������X�|�P�T,,,,,�����@�V�F,,,,2020-2-6,,,,,,
220001,17,�É���,,�b���������@�k���@������,,���H�X�c��,�H��,�M�C�s�������P�S�|�R,,,,,�����@�T��,,,,2020-2-12,,,,,,
220001,18,�É���,,�������ف@����,,���H�X�c��,����,�M�C�s�����P�P�|�P�P,,,,,������Љ��H�m�X,,,,2020-2-18,,,,,,
220001,19,�É���,,�������ف@���ف@�j���[�Γގq,,���H�X�c��,�H��,�M�C�s�����P�P�|�P�P,,,,,������Љ��H�m�X,,,,2020-2-18,,,,,,
220001,20,�É���,,�X�i�b�N�@�܂ǂ�,,���H�X�c��,�H��,�ɓ��s���˂P���ڂV�|�Q,,,,,�򌳁@�ǉ�,,,,2020-2-12,,,,,,
220001,21,�É���,,�Z�u���C���u���ɓ��g�c�X,,���H�X�c��,�H��,�ɓ��s�g�c�P�R�U�|�P,,,,,�i�c�@�B,,,,2020-2-12,,,,,,
220001,22,�É���,,�Z�u���C���u���ɓ��g�c�X,,���ޔ̔���,,�ɓ��s�g�c�P�R�U�|�P,,,,,�i�c�@�B,,,,2020-2-12,,,,,,
220001,23,�É���,,�Z�u���C���u���ɓ��g�c�X,,�H���̔���,��H��,�ɓ��s�g�c�P�R�U�|�P,,,,,�i�c�@�B,,,,2020-2-12,,,,,,
220001,24,�É���,,�s�����@�r�d�`,,���H�X�c��,����,�ɓ��s�F�����P�V�S�U�|�Q,,,,,���T�ƃ��]�[�g�������,,,,2020-2-21,,,,,,
220001,25,�É���,,�L�b�`���@�T�g�t�N,,���H�X�c��,�d�o����,�ɓ��s�K���Q�|�Q,,,,,�{�c�@��ߎq,,,,2020-2-19,,,,,,
220001,26,�É���,,���C�������B���M�C,,���H�X�c��,�H��,�M�C�s���M�C���P���ڂT�|�Q�R,,,,,���C�������B���M�C�Ǘ��g���@�l,,,,2020-2-18,,,,,,
220001,27,�É���,,�M�C����i,,���H�X�c��,������,�M�C�s�������Q�|�Q,,,,,���c�@���q,,,,2020-2-19,,,,,,
220001,28,�É���,,�M�C�t���[�c�L���O,,���H�X�c��,�H��,�M�C�s�����P�|�Q,,,,,�ɓ������r�[���������,,,,2020-2-19,,,,,,
220001,29,�É���,,�M�C�t���[�c�L���O,,�َq������,,�M�C�s�����P�|�Q,,,,,�ɓ������r�[���������,,,,2020-2-19,,,,,,
220001,30,�É���,,�Z�u���C���u���ɓ���ޓX,,���H�X�c��,�H��,�ɓ��s��ނP�Q�Q�T�|�R�Q,,,,,����@�B��,,,,2020-2-25,,,,,,
220001,31,�É���,,�Z�u���C���u���ɓ���ޓX,,���ޔ̔���,,�ɓ��s��ނP�Q�Q�T�|�R�Q,,,,,����@�B��,,,,2020-2-25,,,,,,
220001,32,�É���,,�Z�u���C���u���ɓ���ޓX,,�H���̔���,��H��,�ɓ��s��ނP�Q�Q�T�|�R�Q,,,,,����@�B��,,,,2020-2-25,,,,,,
220001,33,�É���,,�Z�u���C���u���ɓ���ޓX,,�َq������,,�ɓ��s��ނP�Q�Q�T�|�R�Q,,,,,����@�B��,,,,2020-2-25,,,,,,
220001,34,�É���,,�Z�u���|�C���u���ɓ����ɓ������X,,���H�X�c��,�H��,�ɓ��s���R�X�V�|�P�O,,,,,�����@�Е�,,,,2020-2-25,,,,,,
220001,35,�É���,,�Z�u���|�C���u���ɓ����ɓ������X,,�H���̔���,��H��,�ɓ��s���R�X�V�|�P�O,,,,,�����@�Е�,,,,2020-2-25,,,,,,
220001,36,�É���,,�Z�u���|�C���u���ɓ����ɓ������X,,���ޔ̔���,,�ɓ��s���R�X�V�|�P�O,,,,,�����@�Е�,,,,2020-2-25,,,,,,
220001,37,�É���,,�Z�u���|�C���u���ɓ����ɓ������X,,�َq������,,�ɓ��s���R�X�V�|�P�O,,,,,�����@�Е�,,,,2020-2-25,,,,,,
220001,38,�É���,,�����Ƃ�,,���H�X�c��,�H��,�ɓ��s�F�����P�U�U�O�|�Q�R,,,,,�L����Ђ����Ƃ�,,,,2020-2-27,,,,,,
220001,39,�É���,,�x�m�z���z�e��,,�َq������,,�ɓ��s���P�T�Q�S�|�U�X�P,,,,,������Ѓ~���N���]�[�g,,,,2020-2-3,,,,,,
220001,40,�É���,,�L����Ё@�C�V�N,,��������������,,�ɓ��̍��s���؂P�Q�W�T�|�T,,,,,�L����ЊC�V�N,,,,2020-2-17,,,,,,
220001,41,�É���,,�L����Ё@�C�V�N,,���H�X�c��,�d�o����,�ɓ��̍��s���؂P�Q�W�T�|�T,,,,,�L����ЊC�V�N,,,,2020-2-12,,,,,,
220001,42,�É���,,�L����Ё@�C�V�N,,���ޔ̔���,,�ɓ��̍��s���؂P�Q�W�T�|�T,,,,,�L����ЊC�V�N,,,,2020-2-12,,,,,,
220001,43,�É���,,�L����Ё@�C�V�N,,�H���̔���,��H��,�ɓ��̍��s���؂P�Q�W�T�|�T,,,,,�L����ЊC�V�N,,,,2020-2-12,,,,,,
220001,44,�É���,,�L����Ё@�C�V�N,,����ޔ̔���,������,�ɓ��̍��s���؂P�Q�W�T�|�T,,,,,�L����ЊC�V�N,,,,2020-2-12,,,,,,
220001,45,�É���,,�f�`�t�m�d�q,,���H�X�c��,�H��,���Îs�Y�n���V�V,,,,,�n�ӗ���,,,,2020-2-17,,,,,,
220001,46,�É���,,��,,���H�X�c��,�H��,���Îs�㍁�юO�����P�R�W�V�|�Q,,,,,�L����Ѓ��[�g�����O���[�v,,,,2020-2-3,,,,,,
220001,47,�É���,,�N���G�C�g�r�E�c�����������X,,�H���̔���,��H��,�x���S�����������P�Q�|�P,,,,,������ЃN���G�C�g�G�X�E�f�B�[,,,,2020-2-7,,,,,,
220001,48,�É���,,�N���G�C�g�r�E�c�����������X,,����ޔ̔���,������,�x���S�����������P�Q�|�P,,,,,������ЃN���G�C�g�G�X�E�f�B�[,,,,2020-2-7,,,,,,
220001,49,�É���,,�N���G�C�g�r�E�c�����������X,,���ޔ̔���,,�x���S�����������P�Q�|�P,,,,,������ЃN���G�C�g�G�X�E�f�B�[,,,,2020-2-7,,,,,,
220001,50,�É���,,����,,��������������,,�O���s�L���H���P�R�|�Q,,,,,�L����Ѝ���,,,,2020-2-10,,,,,,
220001,51,�É���,,�o�����������o�������� �o�`�s�`�o�`�s�`�T���g���[���X,,���H�X�c��,�H��,�x���S�����������T�Q�|�P,,,,,������Ђ���͂�,,,,2020-2-25,,,,,,
220001,52,�É���,,�X�i�b�N�@�T���V���C��,,���H�X�c��,�H��,�O���s��Ԓ��P�R�|�R,,,,,���@�z�W,,,,2020-2-4,,,,,,
220001,53,�É���,,��ˉ��T���g���[���`�c��X,,���H�X�c��,�H��,�x���S�����������T�Q�|�P,,,,,������ЃT���N�A�C,,,,2020-2-25,,,,,,
220001,54,�É���,,������`�w���������H��,,���H�X�c��,�H��,�O���s�J�c�P�P�P�P,,,,,�L����Ђ�����������,,,,2020-2-4,,,,,,
220001,55,�É���,,�e��������,,���H�X�c��,�H��,�O���s�{���P�R�|�P�O,,,,,�␣����,,,,2020-2-4,,,,,,
220001,56,�É���,,���Ï��E�r�W�l�X���w�Z,,���H�X�c��,�H��,���Îs���𒬂P�V�|�P,,,,,�w�Z�@�l�É����H�ȑ�w,,,,2020-2-5,,,,,,
220001,57,�É���,,���Ï��E�r�W�l�X���w�Z,,���H�X�c��,�d�o����,���Îs���𒬂P�V�|�P,,,,,�w�Z�@�l�É����H�ȑ�w,,,,2020-2-5,,,,,,
220001,58,�É���,,���Ï��E�r�W�l�X���w�Z,,�َq������,,���Îs���𒬂P�V�|�P,,,,,�w�Z�@�l�É����H�ȑ�w,,,,2020-2-5,,,,,,
220001,59,�É���,,���E�{�[�e,,���H�X�c��,�H��,���Îs���䒬�P�U�|�Q,,,,,�����@���,,,,2020-2-5,,,,,,
220001,60,�É���,,���[�O�E��S�E�����ȑ�,,��������������,,�O���s��{���P�|�W�|�S�T,,,,,�L����ПO,,,,2020-2-10,,,,,,
220001,61,�É���,,���[�O�E�����ȑ�,,���H�X�c��,�H��,�O���s��{���P�|�W�|�S�T,,,,,�L����ПO����,,,,2020-2-12,,,,,,
220001,62,�É���,,���ǂ�o���@���т���,,���H�X�c��,�H��,���Îs��蒬�P�|�P�|�U,,,,,������Ђ��т���,,,,2020-2-17,,,,,,
220001,63,�É���,,�{�����ˁ@�c�Ԃ�,,���H�X�c��,�H��,�x���S�����������T�Q�|�P,,,,,������Б�m���C��,,,,2020-2-25,,,,,,
220001,64,�É���,,���͂���,,���H�X�c��,�H��,�O���s���c���X�|�R�O,,,,,������Џ\���Ԃ�,,,,2020-2-26,,,,,,
220001,65,�É���,,�m�H���O���^���E�h���A���X�@�A�[���k�[���H�[,,���H�X�c��,�H��,�x���S�����������T�Q�|�P,,,,,�L����Гc�����@�H�Ə�,,,,2020-2-25,,,,,,
220001,66,�É���,,���[���������񖞌�,,���H�X�c��,�H��,���Îs��蒬�P�|�Q�|�V,,,,,�R�ݍK��,,,,2020-2-13,,,,,,
220001,67,�É���,,�狙�Ɓ@�����v���U�X,,���H�X�c��,�H��,�O���s���c���X�|�R�O,,,,,�H�싻�Y�L�����,,,,2020-2-26,,,,,,
220001,68,�É���,,����ǂ��,,���H�X�c��,�H��,�x���S�����������T�Q�|�P,,,,,������Ѓ~�L�t�[�Y,,,,2020-2-25,,,,,,
220001,69,�É���,,�t�@�~���[�}�[�g�@�ɓ��̍��@�����X,,���H�X�c��,�H��,�ɓ��̍��s�@�����X�Q�O,,,,,����M�l,,,,2020-2-20,,,,,,
220001,70,�É���,,�t�@�~���[�}�[�g�@�ɓ��̍��@�����X,,���ޔ̔���,,�ɓ��̍��s�@�����X�Q�O,,,,,����M�l,,,,2020-2-20,,,,,,
220001,71,�É���,,�t�@�~���[�}�[�g�@�ɓ��̍��@�����X,,�H���̔���,��H��,�ɓ��̍��s�@�����X�Q�O,,,,,����M�l,,,,2020-2-20,,,,,,
220001,72,�É���,,�t�@�~���[�}�[�g�@�ɓ��̍��@�����X,,����ޔ̔���,������,�ɓ��̍��s�@�����X�Q�O,,,,,����M�l,,,,2020-2-20,,,,,,
220001,73,�É���,,�t�@�~���[�}�[�g�@�ɓ��̍��@�����X,,�َq������,,�ɓ��̍��s�@�����X�Q�O,,,,,����M�l,,,,2020-2-20,,,,,,
220001,74,�É���,,�E�G���V�A���Ñ�˓X,,���ޔ̔���,,���Îs��˂Q�O�O�|�T,,,,,�E�G���V�A��Ǌ������,,,,2020-2-17,,,,,,
220001,75,�É���,,�E�G���V�A���Ñ�˓X,,�H���̔���,��H��,���Îs��˂Q�O�O�|�T,,,,,�E�G���V�A��Ǌ������,,,,2020-2-17,,,,,,
220001,76,�É���,,�E�G���V�A���Ñ�˓X,,����ޔ̔���,������,���Îs��˂Q�O�O�|�T,,,,,�E�G���V�A��Ǌ������,,,,2020-2-17,,,,,,
220001,77,�É���,,���Í��ۃJ���g���[�N���u�����X�g����,,���H�X�c��,�H��,���Îs�����S�S�P�|�R�R�S,,,,,������ЃT�b�|�����C�I��,,,,2020-2-25,,,,,,
220001,78,�É���,,�X�e�[�L�c�`�c�`�@�T���g���[���`�c��X,,���H�X�c��,�H��,�x���S�����������T�Q�|�P,,,,,������Ѓn���U��,,,,2020-2-25,,,,,,
220001,79,�É���,,���E���W�@�b�������b������,,���H�X�c��,�H��,�O���s�L���H���X�|�P�R,,,,,�X�c���C,,,,2020-2-18,,,,,,
220001,80,�É���,,�r���������@������ �c��������,,���H�X�c��,�H��,�x���S���򒬉��y��P�R�T�S�|�P�S,,,,,�v�ۓc����,,,,2020-2-13,,,,,,
220001,81,�É���,,�f������ �q������ �a��������������,,���H�X�c��,�H��,�x���S�����������T�Q�|�P,,,,,����@���T,,,,2020-2-27,,,,,,
220001,82,�É���,,�ɓ������P�A�Z���^�[,,���H�X�c��,�H��,�ɓ��s���R�O�S,,,,,�Љ���@�l�@�t����,,,,2020-2-21,,,,,,
220001,83,�É���,,����,,���H�X�c��,�H��,�O���s�L���H���X�|�Q,,,,,�J�J���q,,,,2020-2-18,,,,,,
220001,84,�É���,,���S���[�m�@�T���g���[���`�c��X,,���H�X�c��,�H��,�x���S�����������T�Q�|�P,,,,,������ЃP�[�G�X�e�B�[,,,,2020-2-27,,,,,,
220001,85,�É���,,�d���������@�b������,,���H�X�c��,�H��,�x���S���򒬒|���R�X�Q�|�T,,,,,������Ђl�h�q�`�h,,,,2020-2-25,,,,,,
220001,86,�É���,,�䗢�G,,���H�X�c��,�H��,���Îs���Y�ÉF�P�U�|�P�O,,,,,�Љ���@�l�@�G����,,,,2020-2-20,,,,,,
220001,87,�É���,,�X�i�b�N�Ӓ�,,���H�X�c��,�H��,���Îs�������Q�Q�|�W,,,,,�r�c�@�Y��,,,,2020-2-20,,,,,,
220001,88,�É���,,�u���������x���������������@�T���g���[���`�c��X,,���H�X�c��,�H��,�x���S�����������T�Q�|�P,,,,,������ЃS�g�[,,,,2020-2-25,,,,,,
220001,89,�É���,,���Ђ��͂�@�l�Z�����T���g���[���`�c��X,,���H�X�c��,�H��,�x���S�����������T�Q�|�P,,,,,������ЃC�I���C�[�n�[�g,,,,2020-2-25,,,,,,
220001,90,�É���,,�É��������ÍH�ƍ����w�Z�H��,,���H�X�c��,�H��,���Îs�����є��d�P�Q�X�|�P,,,,,������Ѓz�[���[,,,,2020-2-17,,,,,,
220001,91,�É���,,���ڂ��_���H�[,,�َq������,,���Îs���Y�v���P�S�S�|�R,,,,,�v�ۓc�T�q,,,,2020-2-20,,,,,,
220001,92,�É���,,���ڂ��_���H�[,,���H�X�c��,�d�o����,���Îs���Y�v���P�S�S�|�R,,,,,�v�ۓc�T�q,,,,2020-2-20,,,,,,
220001,93,�É���,,���ˋ������@�悵����,,���H�X�c��,�H��,���Îs��蒬�T�|�V�|�Q�P,,,,,�g���ۍK,,,,2020-2-20,,,,,,
220001,94,�É���,,�{���p�ƒ뗿���@��,,���H�X�c��,�H��,���Îs���蒬�P�R�|�R�Q,,,,,�����H��,,,,2020-2-21,,,,,,
220001,95,�É���,,�Z�u���|�C���u���@���򒆓y��X,,���H�X�c��,�H��,�x���S���򒬒��y��Q�T�W�|�P,,,,,�L����Ѓt�@�C��,,,,2020-2-25,,,,,,
220001,96,�É���,,�Z�u���|�C���u���@���򒆓y��X,,�H���̔���,��H��,�x���S���򒬒��y��Q�T�W�|�P,,,,,�L����Ѓt�@�C��,,,,2020-2-25,,,,,,
220001,97,�É���,,�Z�u���|�C���u���@���򒆓y��X,,���ޔ̔���,,�x���S���򒬒��y��Q�T�W�|�P,,,,,�L����Ѓt�@�C��,,,,2020-2-25,,,,,,
220001,98,�É���,,�Z�u���|�C���u���@���򒆓y��X,,�َq������,,�x���S���򒬒��y��Q�T�W�|�P,,,,,�L����Ѓt�@�C��,,,,2020-2-25,,,,,,
220001,99,�É���,,�V�O�R�b�q�d�o�d�r,,���H�X�c��,�H��,�O���s���c���X�|�R�O,,,,,������Ў��V��,,,,2020-2-27,,,,,,
220001,100,�É���,,�Z�u���|�C���u�����È�o�X,,���H�X�c��,�H��,���Îs��o�R�Q,,,,,�L����Ђ܂�悵,,,,2020-2-21,,,,,,
220001,101,�É���,,�Z�u���|�C���u�����È�o�X,,�H���̔���,��H��,���Îs��o�R�Q,,,,,�L����Ђ܂�悵,,,,2020-2-21,,,,,,
220001,102,�É���,,�Z�u���|�C���u�����È�o�X,,���ޔ̔���,,���Îs��o�R�Q,,,,,�L����Ђ܂�悵,,,,2020-2-21,,,,,,
220001,103,�É���,,�Z�u���|�C���u�����È�o�X,,�َq������,,���Îs��o�R�Q,,,,,�L����Ђ܂�悵,,,,2020-2-21,,,,,,
220001,104,�É���,,���������@��������,,���H�X�c��,�H��,�O���s��{���P�|�P�P,,,,,��ؒq�b��,,,,2020-2-27,,,,,,
220001,105,�É���,,�m�������� ���������@�^�؉�,,���H�X�c��,�H��,�O���s��Ԓ��P�P�|�P�S,,,,,�ΐ��đ�,,,,2020-2-27,,,,,,
220001,106,�É���,,�ɓ��̍������T����,,���H�X�c��,�H��,�ɓ��̍��s�����V�W�Q,,,,,������Е���,,,,2020-2-27,,,,,,
220001,107,�É���,,�܂�����ٓ��@�O�������X,,���H�X�c��,�d�o����,�O���s�����P�|�Q�X�|�P�U,,,,,�L����ЃG�X�E�G�X�E�P�C�C���^�[�i�V���i��,,,,2020-2-26,,,,,,
220001,108,�É���,,��a�ꂾ���@�Ȃ�Έ��,,���H�X�c��,�H��,��a��s�쓇�c�P�R�R�U�|�R,,,,,�����L�v,,,,2020-2-19,,,,,,
220001,109,�É���,,�R�i�Y�����a��,,���H�X�c��,�H��,��a��s���c���T�P�|�P,,,,,������Ѓg���h�[���W���p��,,,,2020-2-6,,,,,,
220001,110,�É���,,�x���ד��x�m�X,,�H�����i������,,�x���S���R���p��P�R�W�V�|�P,,,,,������Ѓx����,,,,2020-2-21,,,,,,
220001,111,�É���,,�Z�u���|�C���u����a��쓇�c�X,,���H�X�c��,�H��,��a��s�쓇�c�P�S�W�X�|�Q,,,,,������Ђo�q�h�c�d�E�n�m�d,,,,2020-2-18,,,,,,
220001,112,�É���,,�Z�u���|�C���u����a��쓇�c�X,,�H���̔���,��H��,��a��s�쓇�c�P�S�W�X�|�Q,,,,,������Ђo�q�h�c�d�E�n�m�d,,,,2020-2-18,,,,,,
220001,113,�É���,,�Z�u���|�C���u����a��쓇�c�X,,���ޔ̔���,,��a��s�쓇�c�P�S�W�X�|�Q,,,,,������Ђo�q�h�c�d�E�n�m�d,,,,2020-2-18,,,,,,
220001,114,�É���,,�Z�u���|�C���u����a��쓇�c�X,,�َq������,,��a��s�쓇�c�P�S�W�X�|�Q,,,,,������Ђo�q�h�c�d�E�n�m�d,,,,2020-2-18,,,,,,
220001,115,�É���,,�S�P�Q �O�Q�Q�R �b������ ������ �a����,,���H�X�c��,�H��,��a��s�V���P�X�S�O�|�P�O,,,,,���[�W�����|�[�g�������,,,,2020-2-17,,,,,,
220001,116,�É���,,�x�͘p������,,���H�X�c��,�H��,��a��s�V���P�X�X�O�|�P�O,,,,,������Ђ�����,,,,2020-2-27,,,,,,
220001,117,�É���,,�G,,���H�X�c��,�H��,��a��s�V���P�X�V�R,,,,,���V�@�G�K,,,,2020-2-27,,,,,,
220001,118,�É���,,�i���j�N���G�C�e�B�u�@�݂��퉀,,���H�X�c��,�H��,�x�m�s����Q�Q�P�O,,,,,������ЃN���G�C�e�B�u,,,,2020-2-17,,,,,,
220001,119,�É���,,���y�̋�ԁ@�Ȃ���,,�݂�������,,�x�m�{�s��M��R�O,,,,,�{�c�@��a,,,,2020-2-13,,,,,,
220001,120,�É���,,�a���� �o�n�`�s�q�`�h�s,,���H�X�c��,�H��,�x�m�s�g���R�|�U�|�Q�Q,,,,,����@����,,,,2020-2-7,,,,,,
220001,121,�É���,,����������R�Z���^�[,,�َq������,,�x�m�{�s���R�Q�S�W�R�|�P�W,,,,,������Е���������,,,,2020-2-14,,,,,,
220001,122,�É���,,�a�����@�c����������,,���H�X�c��,�H��,�x�m�s�g���Q�|�U�|�P,,,,,����@���[,,,,2020-2-20,,,,,,
220001,123,�É���,,�������,,���H�X�c��,�H��,�x�m�s�g���R�|�R�|�P�W,,,,,�����@��,,,,2020-2-7,,,,,,
220001,124,�É���,,�h���[���n�[�g,,���H�X�c��,�H��,�x�m�s����P���ڂV�|�P�T,,,,,���с@�v��,,,,2020-2-14,,,,,,
220001,125,�É���,,�z�e�����[�g�C���V�x�m�w��,,���H�X�c��,����,�x�m�s�{���U�O�Q�|�P,,,,,���[�g�C���W���p���������,,,,2020-2-14,,,,,,
220001,126,�É���,,�{�ʁ@�ʂ悵,,���H�X�c��,�H��,�x�m�{�s����P�W�O�U�|�U,,,,,�g�c�@����,,,,2020-2-19,,,,,,
220001,127,�É���,,�t�@�~���[�}�[�g�x�m�V�����X,,�َq������,,�x�m�s�V�����Q�|�T,,,,,���@����,,,,2020-2-25,,,,,,
220001,128,�É���,,���C�v���c���[,,���H�X�c��,�H��,�x�m�{�s�R�{�R�P�|�X,,,,,�����@�K�i,,,,2020-2-14,,,,,,
220001,129,�É���,,��,,���H�X�c��,�H��,�x�m�s�x�m���V�|�V,,,,,����@��,,,,2020-2-20,,,,,,
220001,130,�É���,,���[�\���x�m�˓c���X,,���H�X�c��,�H��,�x�m�s�˓c���Q�P�W�|�P,,,,,�L����Ё@�x�m����,,,,2020-2-20,,,,,,
220001,131,�É���,,���[�\���x�m�˓c���X,,���ޔ̔���,,�x�m�s�˓c���Q�P�W�|�P,,,,,�L����Ё@�x�m����,,,,2020-2-20,,,,,,
220001,132,�É���,,���[�\���x�m�˓c���X,,�H���̔���,��H��,�x�m�s�˓c���Q�P�W�|�P,,,,,�L����Ё@�x�m����,,,,2020-2-20,,,,,,
220001,133,�É���,,���[�\���x�m�˓c���X,,����ޔ̔���,������,�x�m�s�˓c���Q�P�W�|�P,,,,,�L����Ё@�x�m����,,,,2020-2-20,,,,,,
220001,134,�É���,,�o�t,,���H�X�c��,�H��,�x�m�s���_�{���U�|�S,,,,,����@���D,,,,2020-2-21,,,,,,
220001,135,�É���,,������Е���q��,,���ޔ̔���,,�x�m�s�����P�W�X�|�W,,,,,������Е���q��,,,,2020-2-21,,,,,,
220001,136,�É���,,�t�@�~���[�}�[�g�@���c����񒚖ړX,,���H�X�c��,�H��,���c�s����񒚖ڂP�R�ԂQ�V��,,,,,�����@�a�[,,,,2020-2-6,,,,,,
220001,137,�É���,,�t�@�~���[�}�[�g�@���c����񒚖ړX,,�َq������,,���c�s����񒚖ڂP�R�ԂQ�V��,,,,,�����@�a�[,,,,2020-2-6,,,,,,
220001,138,�É���,,�t�@�~���[�}�[�g�@���c����񒚖ړX,,���ޔ̔���,,���c�s����񒚖ڂP�R�ԂQ�V��,,,,,�����@�a�[,,,,2020-2-6,,,,,,
220001,139,�É���,,�t�@�~���[�}�[�g�@���c����񒚖ړX,,�H���̔���,��H��,���c�s����񒚖ڂP�R�ԂQ�V��,,,,,�����@�a�[,,,,2020-2-6,,,,,,
220001,140,�É���,,�t�@�~���[�}�[�g�@���c����񒚖ړX,,����ޔ̔���,������,���c�s����񒚖ڂP�R�ԂQ�V��,,,,,�����@�a�[,,,,2020-2-6,,,,,,
220001,141,�É���,,�䗿���@���˂��@�k�X,,���H�X�c��,�H��,���c�s�{�ʓ񒚖ڂT�|�R,,,,,�����@�z��,,,,2020-2-25,,,,,,
220001,142,�É���,,�X�}�C���z�e���É��g�c�C���^�[,,���H�X�c��,����,�Y���S�g�c���_�˂P�O�O�T,,,,,������Ѓz�X�s�^���e�B�I�y���[�V�����Y,,,,2020-2-19,,,,,,
220001,143,�É���,,�t�@�~���[�}�[�g�@���c��{�X,,���H�X�c��,�H��,���c�s��{����˂P�T�O�U�ԂS,,,,,���@�T�q,,,,2020-2-13,,,,,,
220001,144,�É���,,�t�@�~���[�}�[�g�@���c��{�X,,���ޔ̔���,,���c�s��{����˂P�T�O�U�ԂS,,,,,���@�T�q,,,,2020-2-13,,,,,,
220001,145,�É���,,�t�@�~���[�}�[�g�@���c��{�X,,����ޔ̔���,������,���c�s��{����˂P�T�O�U�ԂS,,,,,���@�T�q,,,,2020-2-13,,,,,,
220001,146,�É���,,�t�@�~���[�}�[�g�@���c��{�X,,�H���̔���,��H��,���c�s��{����˂P�T�O�U�ԂS,,,,,���@�T�q,,,,2020-2-13,,,,,,
220001,147,�É���,,�t�@�~���[�}�[�g�@���c��{�X,,�َq������,,���c�s��{����˂P�T�O�U�ԂS,,,,,���@�T�q,,,,2020-2-13,,,,,,
220001,148,�É���,,�ĒË��Ɓ@�O�`�①��,,�H�i�̗Ⓚ���͗①��,,�ĒÎs���`�U���ڂP�Q�Q�T�Ԓn,,,,,�ĒË��Ƌ����g��,,,,2020-2-13,,,,,,
220001,149,�É���,,���_��,,�H�p����������,,�Y���S�g�c����K�R�T�W�R�|�V�S,,,,,��΁@���`,,,,2020-2-14,,,,,,
220001,150,�É���,,�c�d�`�q�d�r�s,,���H�X�c��,�H��,���}�s�����R�P�R�|�P,,,,,�쓈�@�D,,,,2020-2-7,,,,,,
220001,151,�É���,,���F����,,���H�X�c��,�H��,�ĒÎs���V�c�P�U�Q�V�|�V,,,,,�k���@����,,,,2020-2-5,,,,,,
220001,152,�É���,,�t�@�~���[�}�[�g�ĒÓ����X,,�َq������,,�ĒÎs�����W�W�T�|�Q,,,,,������Ђr�s�b�E�}�[�g,,,,2020-2-7,,,,,,
220001,153,�É���,,�t�@�~���[�}�[�g���{��o�`���X,,�َq������,,�ĒÎs�Θe���������V�Q�S�|�S,,,,,������Ђr�s�b�E�}�[�g,,,,2020-2-7,,,,,,
220001,154,�É���,,�t�@�~���[�}�[�g�ĒÕl���ړX,,�َq������,,�ĒÎs�l���ڂQ���ڂT�ԂP�R��,,,,,������Ђr�s�b�E�}�[�g,,,,2020-2-7,,,,,,
220001,155,�É���,,�������@�_,,���H�X�c��,�H��,�ĒÎs�w�k�S���ڂP�̂Q�O,,,,,���@�b�q,,,,2020-2-19,,,,,,
220001,156,�É���,,������ЃW���p���E�x���[,,���H�X�c��,�H��,���}�s�쒬�Q���ڂT�|�P,,,,,������ЃW���p���E�x���[,,,,2020-2-25,,,,,,
220001,157,�É���,,�~���N����,,���H�X�c��,�H��,�ĒÎs�ە����Q�T�V�|�P�|�Q,,,,,�������b�q,,,,2020-2-18,,,,,,
220001,158,�É���,,�ނ��b�`�e�d,,�َq������,,���c�s���J�x�m�����R�Q�U�V�|�U,,,,,���{�@�^��,,,,2020-2-13,,,,,,
220001,159,�É���,,�t�@�~���[�}�[�g�@���}�o�`����X,,�َq������,,���}�s�ԑq����J��P�T�W�|�P,,,,,������Ѓt�@�~���[�}�[�g,,,,2020-2-10,,,,,,
220001,160,�É���,,����������,,���H�X�c��,�H��,�ĒÎs������W�|�Q�|�R,,,,,�����@���q,,,,2020-2-25,,,,,,
220001,161,�É���,,���ہ@�V���E�@���q�X,,���H�X�c��,�H��,���c�s����V�V�S�|�P,,,,,���@���P,,,,2020-2-25,,,,,,
220001,162,�É���,,�a�����������@�o�����������������@�o���������e������,,���H�X�c��,����������,���c�s���Q���ڂR�|�R�P,,,,,���c�@���,,,,2020-2-27,,,,,,
220001,163,�É���,,�O�a�p���H�[,,�َq������,,�ĒÎs�O�a�P�T�T�P�|�Q,,,,,����@�c�Y,,,,2020-2-19,,,,,,
220001,164,�É���,,������ЃW���p���E�x���[,,���H�X�c��,�H��,���}�s�쒬�Q���ڂT�|�P,,,,,������ЃW���p���E�x���[,,,,2020-2-25,,,,,,
220001,165,�É���,,�_�C�j���O�o�[�@�`,,���H�X�c��,�H��,���}�s�w�O�Q���ڂW�|�P�O,,,,,���c�@�͎q,,,,2020-2-26,,,,,,
220001,166,�É���,,������̃A�I�L�����X,,�H���̔���,��H��,���}�s�����Q���ڂR�ԂR�R��,,,,,������ЃN�X���̃A�I�L,,,,2020-2-26,,,,,,
220001,167,�É���,,������̃A�I�L�����X,,����ޔ̔���,������,���}�s�����Q���ڂR�ԂR�R��,,,,,������ЃN�X���̃A�I�L,,,,2020-2-26,,,,,,
220001,168,�É���,,������̃A�I�L�����X,,���ޔ̔���,,���}�s�����Q���ڂR�ԂR�R��,,,,,������ЃN�X���̃A�I�L,,,,2020-2-26,,,,,,
220001,169,�É���,,���������߂����,,���H�X�c��,�H��,�q�V���s�����ԂQ�V�R�R�|�Q,,,,,���c �v,,,,2020-2-27,,,,,,
220001,170,�É���,,����@�{��,,���H�X�c��,�H��,�ĒÎs������W���ڂP�|�U,,,,,���{�@������,,,,2020-2-28,,,,,,
220001,171,�É���,,�l�f���@��������,,���H�X�c��,�H��,�ĒÎs�ΒÂS�S�V�@�`,,,,,��؁@���I,,,,2020-2-28,,,,,,
220001,172,�É���,,����݃L�b�`���v���X,,���H�X�c��,�d�o����,���}�s�؂P�|�Q�P�|�P�Q,,,,,������АH�̊w�юɂ����,,,,2020-2-28,,,,,,
220001,173,�É���,,�n�b�s�[,,���H�X�c��,�H��,�֓c�s�����u�P�Q�O�O,,,,,�r�g�q�d�d�r�������,,,,2020-2-18,,,,,,
220001,174,�É���,,�r�߂�@�|��X,,���H�X�c��,�H��,�|��s�דc�Q�Q�T,,,,,������ЃA�C�X�^�C��,,,,2020-2-6,,,,,,
220001,175,�É���,,���ނ��т��Ȃҁ[,,���H�X�c��,�d�o����,�֓c�s���V���X�O�Ԓn,,,,,�ʏ�@����,,,,2020-2-18,,,,,,
220001,176,�É���,,���������`,,���H�X�c��,�H��,�܈�s�L��Q�V�V�V,,,,,�k��@����,,,,2020-2-3,,,,,,
220001,177,�É���,,�O�؂���̃��X�g�����@�q��������,,���H�X�c��,�H��,��O��s�r�V�c�T�U�U�W,,,,,�җс@���K,,,,2020-2-26,,,,,,
220001,178,�É���,,�헅,,���H�X�c��,����,�ΐ��s�h�ÂP�P�O�R�|�W,,,,,�Ėځ@���],,,,2020-2-17,,,,,,
220001,179,�É���,,�O�̓����`�i���j�@�H��,,���H�X�c��,�d�o����,�ΐ��s�V�����V���Q�O�O�|�P�Q,,,,,�O�̓����`�������,,,,2020-2-3,,,,,,
220001,180,�É���,,���{�ːݍH���������,,�i���X�c��,�i���X,�܈�s���V�c������S�P�T,,,,,���{�ːݍH���������,,,,2020-2-6,,,,,,
220001,181,�É���,,�t�@�~���[�}�[�g�@�֓c���c,,���H�X�c��,�H��,�֓c�s��c�����P�Q�W�|�P,,,,,������А��M,,,,2020-2-10,,,,,,
220001,182,�É���,,�t�@�~���[�}�[�g�@�֓c���c,,�H���̔���,��H��,�֓c�s��c�����P�Q�W�|�P,,,,,������А��M,,,,2020-2-10,,,,,,
220001,183,�É���,,�t�@�~���[�}�[�g�@�֓c���c,,���ޔ̔���,,�֓c�s��c�����P�Q�W�|�P,,,,,������А��M,,,,2020-2-10,,,,,,
220001,184,�É���,,�t�@�~���[�}�[�g�@�֓c���c,,����ޔ̔���,������,�֓c�s��c�����P�Q�W�|�P,,,,,������А��M,,,,2020-2-10,,,,,,
220001,185,�É���,,�Ђ�߂̏h,,���H�X�c��,�H��,�|��s���{��S�W�X,,,,,�O�c�@������,,,,2020-2-26,,,,,,
220001,186,�É���,,���k�d�n�b�@�l���z�g�j�N�X�L���k���@�H��,,���H�X�c��,�H��,�֓c�s��ђn�X�P�|�P,,,,,������Ђk�d�n�b,,,,2020-2-27,,,,,,
220001,187,�É���,,���Z����,,���H�X�c��,�H��,���q�S�X���X�P�O�O�R�|�T,,,,,����@�F��,,,,2020-2-19,,,,,,
220001,188,�É���,,�����g�@�|��X,,�َq������,,�|��s�k��T�V,,,,,������Ђ����g,,,,2020-2-19,,,,,,
220001,189,�É���,,꣊����,,���H�X�c��,�H��,�֓c�s���{��X�|�R,,,,,������Ђq�h�m�j�h,,,,2020-2-19,,,,,,
220001,190,�É���,,������쎖�Ə��@�҂̂ف[�Ձ@�V�_�b�N�X�X,,���H�X�c��,�H��,�|��s���J��P�|�P�|�Q�U,,,,,�V�_�b�N�X�t�[�h�T�[�r�X�������,,,,2020-2-26,,,,,,
220001,191,�É���,,�t�@�~���[�}�[�g�֓c����X,,���H�X�c��,�H��,�֓c�s����S�X�U�|�R,,,,,���@���q,,,,2020-2-21,,,,,,
220001,192,�É���,,�t�@�~���[�}�[�g�֓c����X,,�َq������,,�֓c�s����S�X�U�|�R,,,,,���@���q,,,,2020-2-21,,,,,,
220001,193,�É���,,�t�@�~���[�}�[�g�֓c����X,,�H���̔���,��H��,�֓c�s����S�X�U�|�R,,,,,���@���q,,,,2020-2-21,,,,,,
220001,194,�É���,,�t�@�~���[�}�[�g�֓c����X,,����ޔ̔���,������,�֓c�s����S�X�U�|�R,,,,,���@���q,,,,2020-2-21,,,,,,
220001,195,�É���,,�t�@�~���[�}�[�g�֓c����X,,���ޔ̔���,,�֓c�s����S�X�U�|�R,,,,,���@���q,,,,2020-2-21,,,,,,
220001,196,�É���,,���V��,,���H�X�c��,�H��,�|��s�A���Q�|�P�R,,,,,�����@���덁,,,,2020-2-26,,,,,,
220001,197,�É���,,�o�����[�l�b�g���[�N�V�����X,,�H���̔���,����,�ΐ��s�w��R�|�Q�|�T�O,,,,,����@���,,,,2020-2-21,,,,,,
220001,198,�É���,,�U�E�A�~�[�S�X�l���ΐ��X,,���H�X�c��,����������,�ΐ��s�Ì��P�R�P�S,,,,,�U�E�t�F�j�b�N�X�������,,,,2020-2-19,,,,,,
220001,199,�É���,,�U�E�A�~�[�S�X�l���ΐ��X,,�H���̔���,����,�ΐ��s�Ì��P�R�P�S,,,,,�U�E�t�F�j�b�N�X�������,,,,2020-2-19,,,,,,
220001,200,�É���,,�U�E�A�~�[�S�X�l���ΐ��X,,�َq������,,�ΐ��s�Ì��P�R�P�S,,,,,�U�E�t�F�j�b�N�X�������,,,,2020-2-19,,,,,,
220001,201,�É���,,�U�E�A�~�[�S�X�l���ΐ��X,,����ޔ̔���,������,�ΐ��s�Ì��P�R�P�S,,,,,�U�E�t�F�j�b�N�X�������,,,,2020-2-19,,,,,,
220001,202,�É���,,���������X�i�b�N��,,���H�X�c��,�H��,�֓c�s�{�V��F�R�S�R�|�P,,,,,���c�@�ǎq,,,,2020-2-14,,,,,,
220001,203,�É���,,�����|��r�b�i������j�X,,���ޔ̔���,,�|��s�q�^�T�X�U�W�|�S,,,,,������Џ����t�[�Y,,,,2020-2-21,,,,,,
220001,204,�É���,,�����|��r�b�i������j�X,,���H�X�c��,�H��,�|��s�q�^�T�X�U�W�|�S,,,,,������Џ����t�[�Y,,,,2020-2-21,,,,,,
220001,205,�É���,,����ǂ�,,���H�X�c��,�H��,�܈�s����P�Q�P�W�|�R,,,,,��Á@���,,,,2020-2-19,,,,,,
220001,206,�É���,,�Ǘѓ��X�[�o�[�h���b�O�X�g�A�@�V�����w��X,,���ޔ̔���,,�ΐ��s�w��O���ڂQ�ԂT�O��,,,,,������ЈǗѓ����,,,,2020-2-21,,,,,,
220001,207,�É���,,�Ǘѓ��X�[�o�[�h���b�O�X�g�A�@�V�����w��X,,����ޔ̔���,������,�ΐ��s�w��O���ڂQ�ԂT�O��,,,,,������ЈǗѓ����,,,,2020-2-21,,,,,,